Phosalone
- Formula: C12H15ClNO4S2
- Molecular weight: 336.835
- IUPAC Standard InChIKey: IOUNQDKNJZEDEP-UHFFFAOYSA-N
- CAS Registry Number: 2310-17-0
- Chemical structure:
View 3d structure (requires JavaScript / HTML 5) - Other names: Phosphorodithioic acid, S-[(6-chloro-2-oxo-3(2H)-benzoxazolyl)methyl] O,O-diethyl ester; Phosphorodithioic acid, O,O-diethyl ester, S-ester with 6-chloro-3-(mercaptomethyl)-2-benzoxazolinone; Benzophosphate; Chipman 11974; Fosalone; Fozalon; NIA 9241; P 974; Phasolon; Phosalon; Phozalon; Rhodia RP 11974; Rubitox; RP 11974; Zolone; Zolone PM; Zoolon; 3-[O,O-(Diethyldithiophosphoryl)methyl]-6-chlorobenzoxazolinone; 6-Chloro-3-[O,O-(diethyldithiophosphoryl)methyl]benzoxazolone; 11974 RP; Azofene; ENT 27163; O,O-Diethyl phosphorodithioate S-ester with 6-chloro-3-(mercaptomethyl)-2-benzoxazolinone; S-[(6-Chloro-2-oxo-3(2H)-benzoxazoly)methyl] O,O-diethyl phosphorodithioate; Agria 1060; Fosalon; S-(6-Chloro-2-oxobenzoxazolin-3-yl)methyl diethyl phosphorothiolothionate; S-6-chloro-2,3-dihydro-2-oxobenzoxazol-3-ylmethyl O,O-diethylphosphorodithioate

Phase change data

Data compiled as indicated in comments:
TRC - Thermodynamics Research Center, NIST Boulder Laboratories, Chris Muzny director
AC - William E. Acree, Jr., James S. Chickos
Quantity | Value | Units | Method | Reference | Comment |
---|---|---|---|---|---|
Tfus | 321.56 | K | N/A | Donnelly, Drewes, et al., 1990 | Uncertainty assigned by TRC = 0.2 K; TRC |
Tfus | 321.9 | K | N/A | Plato and Glasgow, 1969 | Uncertainty assigned by TRC = 0.1 K; TRC |
Enthalpy of fusion
ΔfusH (kJ/mol) | Temperature (K) | Method | Reference | Comment |
---|---|---|---|---|
30.03 | 320. | DSC | Donnelly, Drewes, et al., 1990, 2 | AC |

Normal alkane RI, non-polar column, custom temperature program

Data compiled by: NIST Mass Spectrometry Data Center, William E. Wallace, director

Column type Capillary
Active phase HP-5
Column length (m) 30.
Carrier gas
Substrate
Column diameter (mm) 0.25
Phase thickness (μm) 0.25
Program 50 0C (1 min) 20 0C/min -> 150 0C 10 0C/min -> 280 0C
I 2537.
ReferenceKawara, Asada, et al., 2005
Comment MSDC-RI

References

Donnelly, Drewes, et al., 1990
Donnelly, J.R.; Drewes, L.A.; Johnson, R.L.; Munslow, W.D.; Knapp, K.K.; Sovocool, G.W.,
Purity and heat of fusion data for environmental standards as determined by differential scanning calorimetry,
Thermochim. Acta, 1990, 167, 2, 155, https://doi.org/10.1016/0040-6031(90)80476-F
. [all data]
Plato and Glasgow, 1969
Plato, C.; Glasgow, A.R., Jr.,
Differential scanning calorimetry as a general method for determining the purity and heat of fusion of high-purity organic chemicals. Application to 95 compounds,
Anal. Chem., 1969, 41, 2, 330, https://doi.org/10.1021/ac60271a041
. [all data]
Donnelly, Drewes, et al., 1990, 2
Donnelly, J.R.; Drewes, L.A.; Johnson, R.L.; Munslow, W.D.; Knapp, K.K.; Sovocool, G.W.,
Purity and heat of fusion data for environmental standards as determined by differential scanning calorimetry,
Thermochimica Acta, 1990, 167, 2, 155-187, https://doi.org/10.1016/0040-6031(90)80476-F
. [all data]