2-Propenoic acid, 3-(4-hydroxy-3-methoxyphenyl)-, methyl ester
- Formula: C11H12O4
- Molecular weight: 208.2106
- IUPAC Standard InChIKey: AUJXJFHANFIVKH-GQCTYLIASA-N
- CAS Registry Number: 2309-07-1
- Chemical structure:
View 3d structure (requires JavaScript / HTML 5) - Other names: Cinnamic acid, 4-hydroxy-3-methoxy-, methyl ester; Ferulic acid methyl ester; Methyl ferulate; Methyl (2E)-3-(4-hydroxy-3-methoxyphenyl)-2-propenoate; Methyl 4'-hydroxy-3'-methoxycinnamate (methyl ferulate)

Phase change data

Data compiled by: William E. Acree, Jr., James S. Chickos
Enthalpy of fusion
ΔfusH (kJ/mol) | Temperature (K) | Method | Reference |
---|---|---|---|
25.84 | 335.7 | DSC | Panteli, Saratsioti, et al., 2010 |

Van Den Dool and Kratz RI, non-polar column, custom temperature program

Column type | Active phase | I | Reference | Comment |
---|---|---|---|---|
Capillary | VF-5MS | 1854.8 | Tret'yakov, 2008 | 30. m/0.25 mm/0.25 μm, He; Program: Multi-step temperature program; T(initial)=60C; T(final)=270C |

References

Panteli, Saratsioti, et al., 2010
Panteli, Eleni; Saratsioti, Panagiota; Stamatis, Haralampos; Voutsas, Epaminondas,
Solubilities of Cinnamic Acid Esters in Organic Solvents,
J. Chem. Eng. Data, 2010, 55, 2, 745-749, https://doi.org/10.1021/je9004382
. [all data]
Tret'yakov, 2008
Tret'yakov, K.V.,
Retention Data. NIST Mass Spectrometry Data Center., NIST Mass Spectrometry Data Center, 2008. [all data]