Pentadecanoic acid, 3-methylbutyl ester
- Formula: C15H30O2
- Molecular weight: 242.3975
- IUPAC Standard InChIKey: XDOGFYDZGUDBQY-UHFFFAOYSA-N
- CAS Registry Number: 2306-91-4
- Chemical structure:
View 3d structure (requires JavaScript / HTML 5) - Other names: iso-Amyl n-decanoate; 3-Methylbuthyl ester of pentadecanoic acid; 3-Methylbutyl decanoate; Isoamyl decanoate; Isopentyl decanoate; 3-Methylbuthyl ester pentadecanoic acid

Kovats' RI, polar column, temperature ramp

Column type | Active phase | I | Reference | Comment |
---|---|---|---|---|
Capillary | Carbowax 20M | 1851. | Tressl, Friese, et al., 1978 | He, 2. K/min; Column length: 50. m; Column diameter: 0.28 mm; Tstart: 70. C; Tend: 190. C |

Van Den Dool and Kratz RI, non-polar column, temperature ramp

Column type | Active phase | I | Reference | Comment |
---|---|---|---|---|
Capillary | CP Sil 5 CB | 1615. | Kafkas, Cabaroglu, et al., 2006 | 25. m/0.25 mm/0.4 μm, He, 5. K/min, 260. C @ 20. min; Tstart: 60. C |

Van Den Dool and Kratz RI, non-polar column, custom temperature program

Column type | Active phase | I | Reference | Comment |
---|---|---|---|---|
Capillary | HP-5MS | 1653.4 | Andriamaharavo, 2014 | 30. m/0.25 mm/0.25 μm, He; Program: 60C (1 min) => 5 C/min => 210C => 10 C/min => 280C (15 min) |

Van Den Dool and Kratz RI, polar column, temperature ramp

Column type | Active phase | I | Reference | Comment |
---|---|---|---|---|
Capillary | ZB-Wax | 1859. | Ledauphin, Saint-Clair, et al., 2004 | 30. m/0.25 mm/0.15 μm, He, 35. C @ 10. min, 1.8 K/min, 220. C @ 10. min |

Van Den Dool and Kratz RI, polar column, custom temperature program

Column type | Active phase | I | Reference | Comment |
---|---|---|---|---|
Capillary | DB-Wax | 1863. | Ferrari, Lablanquie, et al., 2004 | 60. m/0.25 mm/0.25 μm, He; Program: 35C(0.7min) => 20C/min => 70C => 4C/min => 240C |

Normal alkane RI, non-polar column, temperature ramp

Column type | Active phase | I | Reference | Comment |
---|---|---|---|---|
Capillary | SPB-5 | 1647. | Ledauphin, Guichard, et al., 2003 | 30. m/0.32 mm/0.25 μm, He, 40. C @ 1. min, 5. K/min, 220. C @ 20. min |
Capillary | OV-101 | 1627. | Camciuc, Bessière, et al., 1998 | 50. m/0.22 mm/1. μm, He, 100. C @ 1. min, 1. K/min; Tend: 220. C |

Normal alkane RI, non-polar column, custom temperature program

Column type | Active phase | I | Reference | Comment |
---|---|---|---|---|
Capillary | Polydimethyl siloxane with 5 % Ph groups | 1647. | Robinson, Adams, et al., 2012 | Program: not specified |
Capillary | Polydimethyl siloxane with 5 % Ph groups | 1649. | Robinson, Adams, et al., 2012 | Program: not specified |
Capillary | BPX-5 | 1651. | se Souza, Cardeal, et al., 2009 | 30. m/0.25 mm/0.25 μm, Helium; Program: 35 0C (5 min) 3 0C/min -> 210 0C 40 0C/min -> 240 0C (10 min) |
Capillary | BPX-5 | 1644. | se Souza, Cardeal, et al., 2009 | 30. m/0.25 mm/0.25 μm, Helium; Program: not specified |
Capillary | HP-5 | 1641. | Zhao, Li, et al., 2008 | 30. m/0.25 mm/0.25 μm; Program: 40 0C (2 min) 5 0C/min -> 80 0C 7 oC/min -> 160 0C 9 0C/min -> 200 0C 20 0C/min -> 280 0C (10 min) |
Capillary | HP-5 | 1646. | Zhao, Li, et al., 2008 | 30. m/0.25 mm/0.25 μm; Program: not specified |
Capillary | SPB-1 | 1633. | Riu-Aumatell, Bosch-Fuste´, et al., 2006 | 30. m/0.25 mm/0.25 μm; Program: not specified |
Capillary | SE-30 | 1633. | Vinogradov, 2004 | Program: not specified |
Capillary | HP-5 | 1644. | Demyttenaere, Sánchez Martínez, et al., 2003 | 30. m/0.25 mm/0.25 μm, He; Program: 35C => 5C/min => 220C => 10C/min => 240C(5min) |
Capillary | HP-5MS | 1644. | Demyttenaere, Sánchez Martínez, et al., 2002 | 30. m/0.25 mm/0.25 μm, He; Program: 35C => 5C/min => 160C => 10C/min => 220C (10min) |
Capillary | HP-5MS | 1646. | Ansorena, Gimeno, et al., 2001 | 30. m/0.25 mm/0.25 μm, He; Program: 40C (10min) => 3C/min => 120C => 10C/min => 250C (5min) |

Normal alkane RI, polar column, temperature ramp

Column type | Active phase | I | Reference | Comment |
---|---|---|---|---|
Capillary | DB-Wax | 1864. | Zhao, Xu, et al., 2009 | 30. m/0.25 mm/0.25 μm, Helium, 40. C @ 2. min, 3. K/min, 230. C @ 5. min |

Normal alkane RI, polar column, custom temperature program

Column type | Active phase | I | Reference | Comment |
---|---|---|---|---|
Capillary | Carbowax 20M | 1866. | Lee, Chong, et al., 2012 | Program: not specified |
Capillary | DB-Wax | 1868. | Welke, Manfroi, et al., 2012 | 30. m/0.25 mm/0.25 μm, Helium; Program: not specified |
Capillary | DB-Wax | 1871. | Welke, Manfroi, et al., 2012 | 30. m/0.25 mm/0.25 μm, Helium; Program: not specified |
Capillary | DB-Wax | 1863. | Zhao, Xu, et al., 2009 | 30. m/0.25 mm/0.25 μm, Helium; Program: not specified |
Capillary | DB-Wax | 1871. | Yongsheng, Hua, et al., 2008 | 30. m/0.32 mm/0.25 μm, Helium; Program: 40 0C (4 min) 3 0C/min -> 50 0C 5 0C/min -> 120 0C 7 0C/min -> 175 0C 10 0C/min -> 230 0C (8 min) |
Capillary | BP-20 | 1856. | Pontes, Marques, et al., 2007 | 30. m/0.25 mm/0.25 μm, He; Program: 50C(1min) => 2.5C/min => 100C => 2C/min => 180C => 15C/min => 220C |
Capillary | DB-Wax | 1861. | Tian, Zhang, et al., 2007 | 30. m/0.25 mm/0.25 μm, He; Program: 50 0C (2 min) 6 0C/min -> 150 0C 8 0C/min -> 230 0C (15 min) |
Capillary | Supelcowax-10 | 1853. | Riu-Aumatell, Bosch-Fuste´, et al., 2006 | 30. m/0.25 mm/0.25 μm; Program: not specified |
Capillary | Carbowax 20M | 1848. | Vinogradov, 2004 | Program: not specified |
Capillary | Carbowax 20M | 1840. | Vernin, Lageot, et al., 1998 | Program: not specified |

References

Tressl, Friese, et al., 1978
Tressl, R.; Friese, L.; Fendesack, F.; Köppler, H.,
Gas chromatographic--mass spectrometric investigation of hop aroma constituents in beer,
J. Agric. Food Chem., 1978, 26, 6, 1422-1426, https://doi.org/10.1021/jf60220a037
. [all data]
Kafkas, Cabaroglu, et al., 2006
Kafkas, E.; Cabaroglu, T.; Selli, S.; Bozdogan, A.; Kürkçüoglu, M.; Paydas, S.; Baser, K.H.C.,
Identification of volatile aroma compounds of strawberry wine using solid-phase microextraction techniques coupled with gas chromatography-mass spectrometry,
Flavour Fragr. J., 2006, 21, 1, 68-71, https://doi.org/10.1002/ffj.1503
. [all data]
Andriamaharavo, 2014
Andriamaharavo, N.R.,
Retention Data. NIST Mass Spectrometry Data Center., NIST Mass Spectrometry Data Center, 2014. [all data]
Ledauphin, Saint-Clair, et al., 2004
Ledauphin, J.; Saint-Clair, J.-F.; Lablanquie, O.; Guichard, H.; Founier, N.; Guichard, E.; Barillier, D.,
Identification of trace volatile compounds in freshly distilled calvados and cognac using preparative separations coupled with gas chromatography-mass spectrometry,
J. Agric. Food Chem., 2004, 52, 16, 5124-5134, https://doi.org/10.1021/jf040052y
. [all data]
Ferrari, Lablanquie, et al., 2004
Ferrari, G.; Lablanquie, O.; Cantagrel, R.; Ledauphin, J.; Payot, T.; Fournier, N.; Guichard, E.,
Determination of key odorant compounds in freshly distilled cognac using GC-O, GC-MS, and sensory evaluation,
J. Agric. Food Chem., 2004, 52, 18, 5670-5676, https://doi.org/10.1021/jf049512d
. [all data]
Ledauphin, Guichard, et al., 2003
Ledauphin, J.; Guichard, H.; Saint-Clair, J.-F.; Picoche, B.; Barillier, D.,
Chemical and sensorial aroma characterization of freshly distilled calvados. 2. Identification of volatile compounds and key odorants,
J. Agric. Food Chem., 2003, 51, 2, 433-442, https://doi.org/10.1021/jf020373e
. [all data]
Camciuc, Bessière, et al., 1998
Camciuc, M.; Bessière, J.M.; Vilarem, G.; Gaset, A.,
Volatile components in okra seed coat,
Phytochemistry, 1998, 48, 2, 311-315, https://doi.org/10.1016/S0031-9422(97)01127-8
. [all data]
Robinson, Adams, et al., 2012
Robinson, A.L.; Adams, D.O.; Boss, P.K.; Heymann, H.; Solomon, P.S.; Trengove, R.D.,
Influence of geographic origine on the sensory characteristics and wine composition of Vitus viniferas cv. Cabernet Sauvignon wines from Australia (Supplemental data),
Am. J. Enol. Vitic., 2012, 64, 4, 467-476, https://doi.org/10.5344/ajev.2012.12023
. [all data]
se Souza, Cardeal, et al., 2009
se Souza, P.P.; Cardeal, Z.DeL.; Augusti, R.; Morrison, P.; Marriott, P.J.,
Determination of volatile compounds in Brazilian distilled cachaca by using comprehensive two-dimensional gas chromatography and effects of production pathways,
J. Chromatogr. A., 2009, 1216, 14, 2881-2890, https://doi.org/10.1016/j.chroma.2008.10.061
. [all data]
Zhao, Li, et al., 2008
Zhao, Y.; Li, J.; Xu, Y.; Duan, H.; Fan, W.; Zhao, G.,
EXtraction, preparation and identification of volatile compounds in Changyu XO brandy,
Chinese J. Chromatogr., 2008, 26, 2, 212-222, https://doi.org/10.1016/S1872-2059(08)60014-0
. [all data]
Riu-Aumatell, Bosch-Fuste´, et al., 2006
Riu-Aumatell, M.; Bosch-Fuste´, J.; Lopez-Tamames, E.; Buxaderas, S.,
Development of volatile compounds of cava (Spanish sparkling wine) during long ageing time in contact with lees,
Food Chem., 2006, 95, 2, 237-242, https://doi.org/10.1016/j.foodchem.2005.01.029
. [all data]
Vinogradov, 2004
Vinogradov, B.A.,
Production, composition, properties and application of essential oils, 2004, retrieved from http://viness.narod.ru. [all data]
Demyttenaere, Sánchez Martínez, et al., 2003
Demyttenaere, J.C.R.; Sánchez Martínez, J.I.; Verhé, R.; Sandra, P.; de Kimpe, N.,
Analysis of volatiles of malt whisky by solid-phase microextraction and stir bar sorptive extraction,
J. Chromatogr. A, 2003, 985, 1-2, 221-232, https://doi.org/10.1016/S0021-9673(02)01471-1
. [all data]
Demyttenaere, Sánchez Martínez, et al., 2002
Demyttenaere, J.C.R.; Sánchez Martínez, J.I.; Téllez Valdés, M.J.; Verhé, R.; Sandra, P.,
Analysis of volatile esters of malt whisky using solid phase microextraction and dynamic headspace
in 25th International Symposium on Capillary Chromatography, 2002, 1-13. [all data]
Ansorena, Gimeno, et al., 2001
Ansorena, D.; Gimeno, O.; Astiasarán, I.; Bello, J.,
Analysis of volatile compounds by GC-MS of a dry fermented sausage: chorizo de Pamplona,
Food Res. Int., 2001, 34, 1, 67-75, https://doi.org/10.1016/S0963-9969(00)00133-2
. [all data]
Zhao, Xu, et al., 2009
Zhao, Y.; Xu, Y.; Li, J.; Fan, W.; Jiang, W.,
Profile of volatile compounds in 11 brandies by headspace solid-phase microextraction followed by gas chromatography-mass spectrometry,
J. Food. Sci., 2009, 74, 2, c90-c99, https://doi.org/10.1111/j.1750-3841.2008.01029.x
. [all data]
Lee, Chong, et al., 2012
Lee, P.-R.; Chong, I.S.-M.; Yu, B.; Curran, P.; Liu, S.-Q.,
Effect of precursors on volatile compounds in Papaya wine fermented by mixed yeasts,
Uncorrected proof, 2012, 000-000. [all data]
Welke, Manfroi, et al., 2012
Welke, J.E.; Manfroi, V.; Zanus, M.; Lazarotto, M.; Zini, C.A.,
Characterization of the volatile profile of Brazilian merlot wines through comprehensive two dimensional gas chromatography time-of-flight mass spectrometric detection,
J. Chromatogr. A, 2012, 1226, 124-139, https://doi.org/10.1016/j.chroma.2012.01.002
. [all data]
Yongsheng, Hua, et al., 2008
Yongsheng, T.; Hua, L.; Hua, W.; Li, Z.,
Volatile composition of young Cabernet Savignon red wine from Changli Counti (China),
J. Food Composition and Analysis, 2008, 21, 8, 689-694, https://doi.org/10.1016/j.jfca.2008.05.007
. [all data]
Pontes, Marques, et al., 2007
Pontes, M.; Marques, J.C.; Camara, J.S.,
Screening of volatile composition from Portuguese multifloral honeys using headspace solid-phase microextraction-gas chromatography-quadrupole mass spectrometry,
Talanta, 2007, 74, 1, 91-103, https://doi.org/10.1016/j.talanta.2007.05.037
. [all data]
Tian, Zhang, et al., 2007
Tian, Y.; Zhang, X.; Huang, T.; Zou, K.; Zhou, J.,
Research advances on the essential oils from leaves of Eucalyptus,
Food Fermentation Ind. (Chinese), 2007, 33, 10, 143-147. [all data]
Vernin, Lageot, et al., 1998
Vernin, G.; Lageot, C.; Parkanyi, C.,
GC-MS(EI, PCI, NCI, SIM, ITMS) Data Bank Analysis of Flavors and Fragrances. Kovats indices
in Instrumental Methods on Food and Beverage Analysis, D. Wetzel, G. Charalambous, ed(s)., Elsevier Sci. B.V., Amsterdam, 1998, 245-301. [all data]