Cyclododecene, 1-methoxy-, (Z)-
- Formula: C13H24O
- Molecular weight: 196.3291
- IUPAC Standard InChIKey: QKXCGPJJHMULFJ-ACCUITESSA-N
- CAS Registry Number: 23057-12-7
- Chemical structure:
View 3d structure (requires JavaScript / HTML 5) - Stereoisomers:

Reaction thermochemistry data

Data compiled by: Hussein Y. Afeefy, Joel F. Liebman, and Stephen E. Stein
Individual Reactions
By formula: C13H24O = C13H24O
Quantity | Value | Units | Method | Reference | Comment |
---|---|---|---|---|---|
ΔrH° | -9.5 ± 0.3 | kJ/mol | Eqk | Taskinen, 1980 | liquid phase; solvent: Cyclohexane |

References

Taskinen, 1980
Taskinen, E.,
Thermodynamics of vinyl ethers. XXVI. Relative stabilities of the geometrical isomers of 8- to 15-membered 1-methoxycycloalkenes,
Acta Chem. Scand., Ser. B, 1980, 643-646. [all data]