1,6-diphenyl-3-hexene
- Formula: C18H20
- Molecular weight: 236.3514
- IUPAC Standard InChIKey: YGTRBFXKKOTLKK-OWOJBTEDSA-N
- CAS Registry Number: 23055-11-0
- Chemical structure:
View 3d structure (requires JavaScript / HTML 5) - Permanent link for this species. Use this link for bookmarking this species for future reference.

Phase change data

Data compiled by: Thermodynamics Research Center, NIST Boulder Laboratories, Chris Muzny director
Quantity | Value | Units | Method | Reference | Comment |
---|---|---|---|---|---|
Tboil | 613. | K | N/A | Serijan and Wise, 1951 | Uncertainty assigned by TRC = 8. K |
Quantity | Value | Units | Method | Reference | Comment |
Tfus | 264.74 | K | N/A | Serijan and Wise, 1951 | Uncertainty assigned by TRC = 0.3 K |

References

Serijan and Wise, 1951
Serijan, K.T.; Wise, P.H.,
Dicyclic hydrocarboms. IV. Synthesis and Physical properties of alpha,alpha - and alpha,omega-diphenyl- and dicyclohexyl- pentanes and hexanes,
J. Am. Chem. Soc., 1951, 73, 5191. [all data]