Desimipramine acetate
- Formula: C20H24N2O
- Molecular weight: 308.4174
- IUPAC Standard InChIKey: CNKJDYQMSWTPRH-UHFFFAOYSA-N
- CAS Registry Number: 23047-26-9
- Chemical structure:
View 3d structure (requires JavaScript / HTML 5) - Other names: Desipramine, N-acetyl-; N-[3-(10,11-Dihydro-5H-dibenzo[b,f]azepin-5-yl)propyl]-N-methylacetamide; Lofepramine M(Desalkyl), acetylated; Desipramine, acetylated

Van Den Dool and Kratz RI, non-polar column, temperature ramp

Column type | Active phase | I | Reference | Comment |
---|---|---|---|---|
Capillary | VF-5MS | 2776. | Todua, 2011 | 30. m/0.25 mm/0.25 μm, He; Tstart: 60. C; Tend: 270. C |

Normal alkane RI, non-polar column, custom temperature program

Column type | Active phase | I | Reference | Comment |
---|---|---|---|---|
Packed | OV-101 | 2669. | Maurer and Pfleger, 1984 | Program: not specified |
Packed | OV-101 | 2669. | Maurer and Pfleger, 1984 | Program: not specified |

References

Todua, 2011
Todua, N.G.,
Retention Data. NIST Mass Spectrometry Data Center., NIST Mass Spectrometry Data Center, 2011. [all data]
Maurer and Pfleger, 1984
Maurer, H.; Pfleger, K.,
Screening procedure for detection of antidepressants and their metabolites in urine using a computerized gas chromatographic-mass spectrometric technique,
J. Chromatogr., 1984, 305, 309-323, https://doi.org/10.1016/S0378-4347(00)83345-9
. [all data]