Triallate
- Formula: C10H16Cl3NOS
- Molecular weight: 304.664
- IUPAC Standard InChIKey: MWBPRDONLNQCFV-UHFFFAOYSA-N
- CAS Registry Number: 2303-17-5
- Chemical structure:
View 3d structure (requires JavaScript / HTML 5) - Other names: Carbamic acid, diisopropylthio-, S-(2,3,3-trichloroallyl) ester; Avadex BW; CP 23426; Dipthal; Far-Go; S-2,3,3-Trichloroallyl diisopropylthiocarbamate; S-2,3,3-Trichloroallyl N,N-diisopropylthiocarbamate; 2,3,3-Trichloroallyl N,N-diisopropylthiocarbamate; Carbamothioic acid, bis(1-methylethyl)-, S-(2,3,3-trichloro-2-propenyl) ester; N-Diisopropylthiocarbamic acid S-2,3,3-trichloro-2-propenyl ester; N,N-Diisopropyl-2,3,3-trichlorallyl-thiolcarbamate; Diisopropyltrichloroallylthiocarbamate; 2-Propene-1-thiol, 2,3,3-trichloro-, diisopropylcarbamate; Thiocarbamic acid, N-diisopropyl-, S-2,3,3-trichloroallyl ester; Triallat; 2,3,3-Trichlorallyl-N,N-(diisopropyl)-thiocarbamat; 2,3,3-Trichloroallyl diisopropylthiocarbamate; Avadex BE; Far-Go/Avadex BW; S-(2,3,3-Trichloro-2-propenyl) bis(1-methylethyl)carbamothioate; Showdown; NSC 379698; Triamyl; Carbamothioic acid, bis(isopropyl), S-(2,3,3-trichloroallyl) ester

Phase change data

Data compiled as indicated in comments:
TRC - Thermodynamics Research Center, NIST Boulder Laboratories, Chris Muzny director
AC - William E. Acree, Jr., James S. Chickos
Quantity | Value | Units | Method | Reference | Comment |
---|---|---|---|---|---|
Tfus | 307.19 | K | N/A | Donnelly, Drewes, et al., 1990 | Uncertainty assigned by TRC = 0.2 K; TRC |
Enthalpy of vaporization
ΔvapH (kcal/mol) | Temperature (K) | Method | Reference | Comment |
---|---|---|---|---|
20.1 | 305. | A | Stephenson and Malanowski, 1987 | Based on data from 293. to 318. K.; AC |
Enthalpy of sublimation
ΔsubH (kcal/mol) | Temperature (K) | Reference | Comment |
---|---|---|---|
20.1 | 293. to 318. | Spencer and Cliath, 1983 | See also Grover, Spencer, et al., 1978.; AC |
Enthalpy of fusion
ΔfusH (kcal/mol) | Temperature (K) | Method | Reference | Comment |
---|---|---|---|---|
6.479 | 306.4 | DSC | Acree, 1991 | See also Donnelly, Drewes, et al., 1990, 2.; AC |

Kovats' RI, non-polar column, isothermal

Column type | Active phase | Temperature (C) | I | Reference | Comment |
---|---|---|---|---|---|
Capillary | OV-1 | 190. | 1809. | Erdmann, Rochholz, et al., 1992 | |
Capillary | OV-1 | 220. | 1823. | Erdmann, Rochholz, et al., 1992 |

Normal alkane RI, non-polar column, custom temperature program

Column type | Active phase | I | Reference | Comment |
---|---|---|---|---|
Capillary | 5 % Phenyl methyl siloxane | 1827. | Department of Food Safety and Welfare, 2006 | 30. m/0.25 mm/0.25 μm, Helium; Program: 50 0C(1 min) 25 0C/min -> 125 0C 10 0C/min -> 300 0C (10 min) |
Capillary | 5 % Phenyl methyl siloxane | 1827. | Department of Food Safety and Welfare, 2006 | 30. m/0.25 mm/0.25 μm, Helium; Program: 50 0C(1 min) 25 0C/min -> 125 0C 10 0C/min -> 300 0C (10 min) |

References

Donnelly, Drewes, et al., 1990
Donnelly, J.R.; Drewes, L.A.; Johnson, R.L.; Munslow, W.D.; Knapp, K.K.; Sovocool, G.W.,
Purity and heat of fusion data for environmental standards as determined by differential scanning calorimetry,
Thermochim. Acta, 1990, 167, 2, 155, https://doi.org/10.1016/0040-6031(90)80476-F
. [all data]
Stephenson and Malanowski, 1987
Stephenson, Richard M.; Malanowski, Stanislaw,
Handbook of the Thermodynamics of Organic Compounds, 1987, https://doi.org/10.1007/978-94-009-3173-2
. [all data]
Spencer and Cliath, 1983
Spencer, W.F.; Cliath, M.M.,
Measurement of pesticide vapor pressures, 1983, 57-71, https://doi.org/10.1007/978-1-4612-5462-16
. [all data]
Grover, Spencer, et al., 1978
Grover, R.; Spencer, W.F.; Farmer, W.J.; Shoup, T.D.,
Triallate vapor pressure and volatilization from glass surfaces,
Weed Sci., 1978, 26, 5, 505. [all data]
Acree, 1991
Acree, William E.,
Thermodynamic properties of organic compounds: enthalpy of fusion and melting point temperature compilation,
Thermochimica Acta, 1991, 189, 1, 37-56, https://doi.org/10.1016/0040-6031(91)87098-H
. [all data]
Donnelly, Drewes, et al., 1990, 2
Donnelly, J.R.; Drewes, L.A.; Johnson, R.L.; Munslow, W.D.; Knapp, K.K.; Sovocool, G.W.,
Purity and heat of fusion data for environmental standards as determined by differential scanning calorimetry,
Thermochimica Acta, 1990, 167, 2, 155-187, https://doi.org/10.1016/0040-6031(90)80476-F
. [all data]
Erdmann, Rochholz, et al., 1992
Erdmann, F.; Rochholz, G.; Schütz, H.,
Retention-indices on OV-1 of approximately 170 commonly used pesticides,
Mikrochim. Acta, 1992, 106, 3-6, 219-226, https://doi.org/10.1007/BF01242093
. [all data]
Department of Food Safety and Welfare, 2006
Department of Food Safety, Ministry of Health; Welfare,
Analytical methods for residual compositional substances of agricultural chemicals, feed aadditives, and veterinary drugs in foods, 2006, retrieved from http://www.mhlw.go.jp/english/topics/foodsafety/positivelist060228/de/060526-1a.pdf. [all data]