Butane, 1,3-dichloro-2-methyl-
- Formula: C5H10Cl2
- Molecular weight: 141.039
- IUPAC Standard InChIKey: MCAJTVAYCDZHHF-UHFFFAOYSA-N
- CAS Registry Number: 23010-07-3
- Chemical structure:
View 3d structure (requires JavaScript / HTML 5) - Stereoisomers:
- Other names: 1,3-Dichloro-2-methylbutane; 1,3-Dichloro-2-methylbutane, threo

Normal alkane RI, non-polar column, isothermal

Column type | Active phase | Temperature (C) | I | Reference | Comment |
---|---|---|---|---|---|
Capillary | Squalane | 50. | 869. | Tourres, 1968 | Nitrogen; Column length: 50. m; Column diameter: 0.25 mm |
Capillary | Squalane | 70. | 874. | Tourres, 1968 | Nitrogen; Column length: 50. m; Column diameter: 0.25 mm |

References

Tourres, 1968
Tourres, D.A.,
Separation of mono- and dichloro-methyl butanes and of monochloro-methyl butenes by preparative gas chromatography,
Chromatographia, 1968, 1, 11-12, 437-442, https://doi.org/10.1007/BF02255759
. [all data]