1-Butene, 1-chloro-3-methyl-
- Formula: C5H9Cl
- Molecular weight: 104.578
- IUPAC Standard InChIKey: MXVSJNLRVLKAOG-ONEGZZNKSA-N
- CAS Registry Number: 23010-00-6
- Chemical structure:
View 3d structure (requires JavaScript / HTML 5) - Species with the same structure:
- Stereoisomers:
- Other names: 1-Chloro-3-methyl-1-butene; β-Isopropylvinyl chloride; 3-Methyl-1-chloro-1-butene

Normal alkane RI, non-polar column, isothermal

Column type | Active phase | Temperature (C) | I | Reference | Comment |
---|---|---|---|---|---|
Capillary | Squalane | 30. | 661. | Tourres, 1968 | Nitrogen; Column length: 50. m; Column diameter: 0.25 mm |
Capillary | Squalane | 50. | 663. | Tourres, 1968 | Nitrogen; Column length: 50. m; Column diameter: 0.25 mm |

Normal alkane RI, non-polar column, temperature ramp

Column type | Active phase | I | Reference | Comment |
---|---|---|---|---|
Capillary | OV-101 | 668. | Zenkevich, 2005 | 25. m/0.20 mm/0.10 μm, N2/He, 6. K/min; Tstart: 50. C; Tend: 250. C |

References

Tourres, 1968
Tourres, D.A.,
Separation of mono- and dichloro-methyl butanes and of monochloro-methyl butenes by preparative gas chromatography,
Chromatographia, 1968, 1, 11-12, 437-442, https://doi.org/10.1007/BF02255759
. [all data]
Zenkevich, 2005
Zenkevich, I.G.,
Experimentally measured retention indices., 2005. [all data]