Benzene, 1-(1-ethylpropyl)-4-methyl-
- Formula: C12H18
- Molecular weight: 162.2713
- IUPAC Standard InChIKey: HFPPJNVUPMBSBN-UHFFFAOYSA-N
- CAS Registry Number: 22975-58-2
- Chemical structure:
View 3d structure (requires JavaScript / HTML 5) - Other names: Toluene, p-(1-ethylpropyl)-; 1-(1-Ethylpropyl)-4-methylbenzene; 3-(4-Tolyl)-pentane; Pentane, 3-(4-tolyl)

Kovats' RI, polar column, isothermal

Column type | Active phase | Temperature (C) | I | Reference | Comment |
---|---|---|---|---|---|
Capillary | Carbowax 20M | 90. | 1371.2 | Döring, Estel, et al., 1974 | Column length: 100. m; Column diameter: 0.2 mm |

Normal alkane RI, polar column, isothermal

Column type | Active phase | Temperature (C) | I | Reference | Comment |
---|---|---|---|---|---|
Capillary | Carbowax 20M | 90. | 1371. | Sutter, Peterson, et al., 1997 |

References

Döring, Estel, et al., 1974
Döring, C.E.; Estel, D.; Fischer, R.,
Kapillar-gaschromatographische Charakterisierung von C10-bis C12-Aromaten,
J. Prakt. Chem., 1974, 316, 1, 1-12, https://doi.org/10.1002/prac.19743160102
. [all data]
Sutter, Peterson, et al., 1997
Sutter, J.M.; Peterson, T.A.; Jurs, P.C.,
Prediction of gas chromatographic retention indices of alkylbenzenes,
Anal. Chim. Acta., 1997, 342, 2-3, 113-122, https://doi.org/10.1016/S0003-2670(96)00578-8
. [all data]