Benzeneacetic acid, α-ethyl-, methyl ester
- Formula: C11H14O2
- Molecular weight: 178.2277
- IUPAC Standard InChIKey: PPIQQNDMGXNRFA-UHFFFAOYSA-N
- CAS Registry Number: 2294-71-5
- Chemical structure:
View 3d structure (requires JavaScript / HTML 5) - Other names: Butyric acid, 2-phenyl-, methyl ester; Methyl α-phenylbutyrate; Methyl 2-phenylbutyrate; (.+/-.)-2-Phenylbutyric acid, methyl ester; Methyl 2-phenylbutanoate

Van Den Dool and Kratz RI, non-polar column, custom temperature program

Column type | Active phase | I | Reference | Comment |
---|---|---|---|---|
Capillary | VF-5MS | 1287.1 | Tret'yakov, 2007 | 30. m/0.25 mm/0.25 μm, He; Program: Multi-step temperature program; T(initial)=60C; T(final)=270C |
Capillary | VF-5MS | 1287.3 | Tret'yakov, 2007 | 30. m/0.25 mm/0.25 μm, He; Program: Multi-step temperature program; T(initial)=60C; T(final)=270C |

References

Tret'yakov, 2007
Tret'yakov, K.V.,
Retention Data. NIST Mass Spectrometry Data Center., NIST Mass Spectrometry Data Center, 2007. [all data]