1-Hexene, 1-chloro-
- Formula: C6H11Cl
- Molecular weight: 118.605
- IUPAC Standard InChIKey: UZIBPOIXTCIHBH-AATRIKPKSA-N
- CAS Registry Number: 22922-67-4
- Chemical structure:
View 3d structure (requires JavaScript / HTML 5) - Species with the same structure:
- Stereoisomers:
- Other names: 1-chloro-1-hexene

Normal alkane RI, non-polar column, temperature ramp

Column type | Active phase | I | Reference | Comment |
---|---|---|---|---|
Capillary | OV-101 | 788. | Zenkevich, 2005 | 25. m/0.20 mm/0.10 μm, N2/He, 6. K/min; Tstart: 50. C; Tend: 250. C |

References

Zenkevich, 2005
Zenkevich, I.G.,
Experimentally measured retention indices., 2005. [all data]