Cyclohexanol, 4-(1-methylethyl)-, cis-
- Formula: C9H18O
- Molecular weight: 142.2386
- IUPAC Standard InChIKey: DKKRDMLKVSKFMJ-DTORHVGOSA-N
- CAS Registry Number: 22900-08-9
- Chemical structure:
View 3d structure (requires JavaScript / HTML 5) - Stereoisomers:
- Other names: Cyclohexanol, cis-4-(1-methylethyl); cis-4-(1-methylethyl)cyclohexanol

Kovats' RI, non-polar column, isothermal

Column type | Active phase | Temperature (C) | I | Reference | Comment |
---|---|---|---|---|---|
Packed | Apiezon L | 130. | 1165. | Paris and Alexandre, 1972 | Chromosorb W AW |

References

Paris and Alexandre, 1972
Paris, C.; Alexandre, P.,
Stereochemical Investigation of Cyclohexane and Terpene Compounds by Gas Chromatography,
J. Chromatogr. Sci., 1972, 10, 6, 402-411, https://doi.org/10.1093/chromsci/10.6.402
. [all data]