Bicyclo[2.2.1]heptan-1-carboxylic acid, methyl ester
- Formula: C9H14O2
- Molecular weight: 154.2063
- IUPAC Standard InChIKey: ICBCULSDMSBNNZ-UHFFFAOYSA-N
- CAS Registry Number: 2287-57-2
- Chemical structure:
View 3d structure (requires JavaScript / HTML 5) - Other names: Methyl bicyclo(2.2.1)heptane-1-carboxylate

Phase change data

Data compiled by: Robert L. Brown and Stephen E. Stein
Reduced pressure boiling point
Tboil (K) | Pressure (bar) | Reference |
---|---|---|
325. to 326. | 0.0024 | Buckingham and Donaghy, 1982 |

Kovats' RI, non-polar column, isothermal

Column type | Active phase | Temperature (C) | I | Reference | Comment |
---|---|---|---|---|---|
Packed | SE-30 | 140. | 1120. | Heintz, Gruselle, et al., 1976 | Chromosorb W (60-80 mesh); Column length: 2. m |
Packed | Squalane | 150. | 1092. | Schomburg, 1964 |

Kovats' RI, polar column, isothermal

Column type | Active phase | Temperature (C) | I | Reference | Comment |
---|---|---|---|---|---|
Packed | Carbowax 20M | 140. | 1487. | Heintz, Gruselle, et al., 1976 | Chromosorb W (60-80 mesh); Column length: 2. m |

References

Buckingham and Donaghy, 1982
Buckingham, J.; Donaghy, S.M.,
Dictionary of Organic Compounds: Fifth Edition, Chapman and Hall, New York, 1982, 1. [all data]
Heintz, Gruselle, et al., 1976
Heintz, M.; Gruselle, M.; Druilhe, A.; Lefort, D.,
Relations entre structure chimique et données de rétention en chromatographie en phase gaseuse. VI. Alcools et esters méthyliques de structures cycliques,
Chromatographia, 1976, 9, 8, 367-372, https://doi.org/10.1007/BF02330385
. [all data]
Schomburg, 1964
Schomburg, G.,
Gas-Chromatographische Retentionsdaten und Struktur Chemischer Verbindungen. I. Verzweigte Aliphatische und Alicyclische Carbonsäure-Methylester,
J. Chromatogr., 1964, 14, 157-177, https://doi.org/10.1016/S0021-9673(00)86608-X
. [all data]