4-Pentenoic acid butyl ester
- Formula: C9H16O2
- Molecular weight: 156.2221
- IUPAC Standard InChIKey: FSTRNYPZAMXNTC-UHFFFAOYSA-N
- CAS Registry Number: 22874-80-2
- Chemical structure:
View 3d structure (requires JavaScript / HTML 5) - Permanent link for this species. Use this link for bookmarking this species for future reference.

Gas phase thermochemistry data

Data compiled by: Hussein Y. Afeefy, Joel F. Liebman, and Stephen E. Stein
Quantity | Value | Units | Method | Reference | Comment |
---|---|---|---|---|---|
ΔfH°gas | -427. ± 2. | kJ/mol | Ccb | Schjanberg, 1937 | Heat of formation derived by Cox and Pilcher, 1970 |

Condensed phase thermochemistry data

Data compiled by: Hussein Y. Afeefy, Joel F. Liebman, and Stephen E. Stein
Quantity | Value | Units | Method | Reference | Comment |
---|---|---|---|---|---|
ΔfH°liquid | -480. ± 2. | kJ/mol | Ccb | Schjanberg, 1937 | Heat of formation derived by Cox and Pilcher, 1970 |
Quantity | Value | Units | Method | Reference | Comment |
ΔcH°liquid | -5348.4 ± 1.7 | kJ/mol | Ccb | Schjanberg, 1937 | Reanalyzed by Cox and Pilcher, 1970, Original value = -5343. ± 4. kJ/mol; At 293 K; Corresponding ΔfHºliquid = -479.82 kJ/mol (simple calculation by NIST; no Washburn corrections) |

Phase change data

Data compiled as indicated in comments:
ALS - Hussein Y. Afeefy, Joel F. Liebman, and Stephen E. Stein
DRB - Donald R. Burgess, Jr.
Quantity | Value | Units | Method | Reference | Comment |
---|---|---|---|---|---|
ΔvapH° | 53. ± 1. | kJ/mol | E | Schjanberg, 1937 | Heat of formation derived by Cox and Pilcher, 1970; ALS |
ΔvapH° | 53.0 | kJ/mol | N/A | Schjanberg, 1937 | DRB |
Enthalpy of vaporization
ΔvapH (kJ/mol) | Temperature (K) | Method | Reference | Comment |
---|---|---|---|---|
41. | 293. | V | Schjanberg, 1937 | At 293 K; ALS |

References

Schjanberg, 1937
Schjanberg, E.,
Die verbrennungswarmen und die refraktionsdaten einiger pentensaureeste,
Z. Phys. Chem., 1937, 178, 274-281. [all data]
Cox and Pilcher, 1970
Cox, J.D.; Pilcher, G.,
Thermochemistry of Organic and Organometallic Compounds, Academic Press, New York, 1970, 1-636. [all data]