Tetrahydro-2,2,6,6-tetramethyl-4H-thiopyran-4-one
- Formula: C9H16OS
- Molecular weight: 172.288
- IUPAC Standard InChIKey: CGAPIUWHWGPGJN-UHFFFAOYSA-N
- CAS Registry Number: 22842-41-7
- Chemical structure:
View 3d structure (requires JavaScript / HTML 5) - Permanent link for this species. Use this link for bookmarking this species for future reference.

Gas phase thermochemistry data

Data compiled by: Hussein Y. Afeefy, Joel F. Liebman, and Stephen E. Stein
Quantity | Value | Units | Method | Reference | Comment |
---|---|---|---|---|---|
ΔfH°gas | -291. ± 3.0 | kJ/mol | Ccb | Geiseler and Sawistowsky, 1972 |

Condensed phase thermochemistry data

Data compiled by: Hussein Y. Afeefy, Joel F. Liebman, and Stephen E. Stein
Quantity | Value | Units | Method | Reference | Comment |
---|---|---|---|---|---|
ΔcH°liquid | -6102.4 ± 2.9 | kJ/mol | Ccb | Geiseler and Sawistowsky, 1972 |

Phase change data

Data compiled as indicated in comments:
ALS - Hussein Y. Afeefy, Joel F. Liebman, and Stephen E. Stein
AC - William E. Acree, Jr., James S. Chickos
Quantity | Value | Units | Method | Reference | Comment |
---|---|---|---|---|---|
ΔvapH° | 37.0 | kJ/mol | V | Geiseler and Sawistowsky, 1972 | ALS |
Enthalpy of vaporization
ΔvapH (kJ/mol) | Temperature (K) | Method | Reference | Comment |
---|---|---|---|---|
34.7 | 315. | A | Stephenson and Malanowski, 1987 | Based on data from 300. to 360. K. See also Geiseler and Sawistowsky, 1972, 2 and Dykyj, Svoboda, et al., 1999.; AC |

References

Geiseler and Sawistowsky, 1972
Geiseler, V.G.; Sawistowsky, J.,
Bildungsenthalpien und Mesomerieenergien von π-Bindungssystemen. 4. Mitteilung: Bildungsenthalpien einiger Thiacyclannone,
Z. Phys. Chem. (Leipzig), 1972, 250, 43-48. [all data]
Stephenson and Malanowski, 1987
Stephenson, Richard M.; Malanowski, Stanislaw,
Handbook of the Thermodynamics of Organic Compounds, 1987, https://doi.org/10.1007/978-94-009-3173-2
. [all data]
Geiseler and Sawistowsky, 1972, 2
Geiseler, G.; Sawistowsky, J.,
Z. Phys. Chem. (Leipzig), 1972, 250, 1-2, 43. [all data]
Dykyj, Svoboda, et al., 1999
Dykyj, J.; Svoboda, J.; Wilhoit, R.C.; Frenkel, M.L.; Hall, K.R.,
Vapor Pressure of Chemicals: Part A. Vapor Pressure and Antoine Constants for Hydrocarbons and Sulfur, Selenium, Tellurium and Hydrogen Containing Organic Compounds, Springer, Berlin, 1999, 373. [all data]