3-Hexene, 2,2,5,5-tetramethyl-
- Formula: C10H20
- Molecular weight: 140.2658
- IUPAC Standard InChIKey: UYWLQEPMPVDASH-UHFFFAOYSA-N
- CAS Registry Number: 22808-06-6
- Chemical structure:
View 3d structure (requires JavaScript / HTML 5) - Stereoisomers:
- Other names: 2,2,5,5-tetramethylhex-3-ene

Phase change data

Data compiled as indicated in comments:
TRC - Thermodynamics Research Center, NIST Boulder Laboratories, Chris Muzny director
AC - William E. Acree, Jr., James S. Chickos
DH - Eugene S. Domalski and Elizabeth D. Hearing
Quantity | Value | Units | Method | Reference | Comment |
---|---|---|---|---|---|
Tboil | 398.4 | K | N/A | Anonymous, 1950 | Uncertainty assigned by TRC = 1. K; TRC |
Tboil | 398.16 | K | N/A | Howard, Mears, et al., 1947 | Uncertainty assigned by TRC = 0.1 K; TRC |
Tboil | 396.4 | K | N/A | Moersch, 1942 | Uncertainty assigned by TRC = 1.5 K; TRC |
Quantity | Value | Units | Method | Reference | Comment |
Tfus | 268.8 | K | N/A | Byström, 1980 | Crystal phase 1 phase; Uncertainty assigned by TRC = 1. K; TRC |
Tfus | 268.4 | K | N/A | Howard, Mears, et al., 1947 | Uncertainty assigned by TRC = 0.1 K; TRC |
Enthalpy of fusion
ΔfusH (kJ/mol) | Temperature (K) | Method | Reference | Comment |
---|---|---|---|---|
10.25 | 268.9 | DSC | Byström, 1980 | AC |
Enthalpy of phase transition
ΔHtrs (kJ/mol) | Temperature (K) | Initial Phase | Final Phase | Reference | Comment |
---|---|---|---|---|---|
1.210 | 235.7 | crystaline, III | crystaline, II | Bystroem, 1980 | DH |
4.330 | 243.5 | crystaline, II | crystaline, I | Bystroem, 1980 | DH |
10.250 | 268.8 | crystaline, I | liquid | Bystroem, 1980 | DH |
Entropy of phase transition
ΔStrs (J/mol*K) | Temperature (K) | Initial Phase | Final Phase | Reference | Comment |
---|---|---|---|---|---|
5.13 | 235.7 | crystaline, III | crystaline, II | Bystroem, 1980 | DH |
17.8 | 243.5 | crystaline, II | crystaline, I | Bystroem, 1980 | DH |
38.1 | 268.8 | crystaline, I | liquid | Bystroem, 1980 | DH |

References

Anonymous, 1950
Anonymous, R.,
, Am. Pet. Inst. Res. Proj. 6, Natl. Bur. Stand., 1950. [all data]
Howard, Mears, et al., 1947
Howard, F.L.; Mears, T.W.; Fookson, A.; Pomerantz, P.; Brooks, D.B.,
Preparation and physical properties of several aliphatic hydrocarbons and intermediates,
J. Res. Natl. Bur. Stand. (U. S.), 1947, 38, 365. [all data]
Moersch, 1942
Moersch, G.W.,
, Ph.D. Thesis, Penn. State Univ., Univ. Park, PA, 1942. [all data]
Byström, 1980
Byström, Katarina,
Solid--solid phase transitions in azoxy compounds,
J. Chem. Soc., Faraday Trans. 1, 1980, 76, 0, 1986, https://doi.org/10.1039/f19807601986
. [all data]
Bystroem, 1980
Bystroem, K.,
Solid-solid phase transitions in azoxy compounds, J. Chem. Soc.,
Faraday Trans., 1980, 1 76(9), 1986-1990. [all data]