2-Nitrobenzeneacetyl chloride
- Formula: C8H6ClNO3
- Molecular weight: 199.591
- IUPAC Standard InChIKey: BKTDBYAOZVFUNR-UHFFFAOYSA-N
- CAS Registry Number: 22751-23-1
- Chemical structure:
View 3d structure (requires JavaScript / HTML 5) - Permanent link for this species. Use this link for bookmarking this species for future reference.

Phase change data

Data compiled by: William E. Acree, Jr., James S. Chickos
Enthalpy of sublimation
ΔsubH (kJ/mol) | Temperature (K) | Method | Reference | Comment |
---|---|---|---|---|
103.6 | 311. | TE | Stephenson and Malanowski, 1987 | Based on data from 296. to 327. K. See also Balson, 1947 and Jones, 1960. |

References

Stephenson and Malanowski, 1987
Stephenson, Richard M.; Malanowski, Stanislaw,
Handbook of the Thermodynamics of Organic Compounds, 1987, https://doi.org/10.1007/978-94-009-3173-2
. [all data]
Balson, 1947
Balson, E.W.,
Studies in vapour pressure measurement, Part III.?An effusion manometer sensitive to 5 «65533» 10?6 millimetres of mercury: vapour pressure of D.D.T. and other slightly volatile substances,
Trans. Faraday Soc., 1947, 43, 54, https://doi.org/10.1039/tf9474300054
. [all data]
Jones, 1960
Jones, A.H.,
Sublimation Pressure Data for Organic Compounds.,
J. Chem. Eng. Data, 1960, 5, 2, 196-200, https://doi.org/10.1021/je60006a019
. [all data]