Methanesulfonylacetonitrile
- Formula: C3H5NO2S
- Molecular weight: 119.142
- IUPAC Standard InChIKey: FOTRKCAZUSJCQD-UHFFFAOYSA-N
- CAS Registry Number: 2274-42-2
- Chemical structure:
View 3d structure (requires JavaScript / HTML 5) - Other names: Methylsulfonylacetonitrile; Acetonitrile, (methylsulfonyl)-; mesylacetonitrile

Reaction thermochemistry data

Data compiled by: John E. Bartmess
Individual Reactions
C3H4NO2S- + =
By formula: C3H4NO2S- + H+ = C3H5NO2S
Quantity | Value | Units | Method | Reference | Comment |
---|---|---|---|---|---|
ΔrH° | 1407. ± 9.6 | kJ/mol | G+TS | Taft, Abboud, et al., 1988 | gas phase; Revised: this is 0.9 smaller than reported (91TAF) |
Quantity | Value | Units | Method | Reference | Comment |
ΔrG° | 1375. ± 8.4 | kJ/mol | IMRE | Taft, Abboud, et al., 1988 | gas phase; Revised: this is 0.9 smaller than reported (91TAF) |

Gas phase ion energetics data

Data compiled by: John E. Bartmess
De-protonation reactions
C3H4NO2S- + =
By formula: C3H4NO2S- + H+ = C3H5NO2S
Quantity | Value | Units | Method | Reference | Comment |
---|---|---|---|---|---|
ΔrH° | 1407. ± 9.6 | kJ/mol | G+TS | Taft, Abboud, et al., 1988 | gas phase; Revised: this is 0.9 smaller than reported (91TAF) |
Quantity | Value | Units | Method | Reference | Comment |
ΔrG° | 1375. ± 8.4 | kJ/mol | IMRE | Taft, Abboud, et al., 1988 | gas phase; Revised: this is 0.9 smaller than reported (91TAF) |

References

Taft, Abboud, et al., 1988
Taft, R.W.; Abboud, J.L.M.; Anvia, F.; Berthelot, M.; Fujio, M.; Gal, J.-F.; Headley, A.D.; Henderson, W.G.,
Regarding the Inherent Dependence of Resonance Effects of Strongly Conjugated Substituents on Electron Demand,
J. Am. Chem. Soc., 1988, 110, 6, 1797, https://doi.org/10.1021/ja00214a023
. [all data]