Benzenamine, 4-methyl-N-(phenylmethylene)-
- Formula: C14H13N
- Molecular weight: 195.2597
- IUPAC Standard InChIKey: MSFVFFZPHJPOHP-UHFFFAOYSA-N
- CAS Registry Number: 2272-45-9
- Chemical structure:
View 3d structure (requires JavaScript / HTML 5) - Other names: Benzylidene-(4-methylphenyl)-amine; N-benzylidene-p-toluidine

Phase change data

Data compiled by: Robert L. Brown and Stephen E. Stein
Reduced pressure boiling point
Tboil (K) | Pressure (atm) | Reference |
---|---|---|
451.2 | 0.014 | Weast and Grasselli, 1989 |

References

Weast and Grasselli, 1989
CRC Handbook of Data on Organic Compounds, 2nd Editon, Weast,R.C and Grasselli, J.G., ed(s)., CRC Press, Inc., Boca Raton, FL, 1989, 1. [all data]