p-Nitrobenzil
- Formula: C14H9NO4
- Molecular weight: 255.2256
- IUPAC Standard InChIKey: GPDKREBNFFEDHW-UHFFFAOYSA-N
- CAS Registry Number: 22711-24-6
- Chemical structure:
View 3d structure (requires JavaScript / HTML 5) - Permanent link for this species. Use this link for bookmarking this species for future reference.

Condensed phase thermochemistry data

Data compiled by: Hussein Y. Afeefy, Joel F. Liebman, and Stephen E. Stein
Quantity | Value | Units | Method | Reference | Comment |
---|---|---|---|---|---|
ΔcH°solid | -6698.2 | kJ/mol | Ccb | Barker, 1925 |

References

Barker, 1925
Barker, M.F.,
Calorific value and constitution,
J. Phys. Chem., 1925, 29, 1345-1363. [all data]