Benzoic acid, 2-methoxy-, pentyl ester
- Formula: C13H18O3
- Molecular weight: 222.2802
- IUPAC Standard InChIKey: TYLMQMJLOUNOGK-UHFFFAOYSA-N
- CAS Registry Number: 22708-14-1
- Chemical structure:
View 3d structure (requires JavaScript / HTML 5) - Other names: o-Methoxybenzoic acid, pentyl ester; Pentyl 2-methoxybenzoate; pentyl o-anisate

Van Den Dool and Kratz RI, non-polar column, temperature ramp

Column type | Active phase | I | Reference | Comment |
---|---|---|---|---|
Capillary | VF-5MS | 1710. | Todua, 2011 | 30. m/0.25 mm/0.25 μm, He; Tstart: 60. C; Tend: 270. C |

Van Den Dool and Kratz RI, non-polar column, custom temperature program

Column type | Active phase | I | Reference | Comment |
---|---|---|---|---|
Capillary | 5 % Phenyl methyl siloxane | 1700.6 | Zaikin, 2003 | Column length: 30. m; Column diameter: 0.19 mm; Program: 50 C to 120 C at 5 C/min; 120 C to 290 C at 12 C/min |

References

Todua, 2011
Todua, N.G.,
Retention Data. NIST Mass Spectrometry Data Center., NIST Mass Spectrometry Data Center, 2011. [all data]
Zaikin, 2003
Zaikin, V.G.,
Personal Communication: Retention indices measured during the period 2001 to 2003, 2003. [all data]