(R)-4-hydroxy-2-pyrrolidone

Phase change data

Data compiled by: William E. Acree, Jr., James S. Chickos

Enthalpy of fusion

ΔfusH (kJ/mol) Temperature (K) Method Reference
23.41392.DSCWang, Wiehler, et al., 2004

References

Wang, Wiehler, et al., 2004
Wang, Xiu Juan; Wiehler, Harald; Ching, Chi Bun, Study of the characterization and crystallization of 4-hydroxy-2-pyrrolidone, Chirality, 2004, 16, 4, 220-227, https://doi.org/10.1002/chir.20021 . [all data]