3-(S)-octanol
- Formula: C8H18O
- Molecular weight: 130.2279
- IUPAC Standard InChIKey: NMRPBPVERJPACX-MRVPVSSYSA-N
- CAS Registry Number: 22658-92-0
- Chemical structure:
View 3d structure (requires JavaScript / HTML 5) - Stereoisomers:

Phase change data

Data compiled by: Thermodynamics Research Center, NIST Boulder Laboratories, Chris Muzny director
Quantity | Value | Units | Method | Reference | Comment |
---|---|---|---|---|---|
Tboil | 450.15 | K | N/A | Geiseler, Fruwert, et al., 1962 | Uncertainty assigned by TRC = 2. K |
Tboil | 446.15 | K | N/A | Kallina and Kuffner, 1960 | Uncertainty assigned by TRC = 2. K |
Tboil | 446.15 | K | N/A | Woods and Viola, 1956 | Uncertainty assigned by TRC = 2. K |
Tboil | 446.15 | K | N/A | Dorough, Glass, et al., 1941 | Uncertainty assigned by TRC = 1. K |

References

Geiseler, Fruwert, et al., 1962
Geiseler, G.; Fruwert, J.; Stockel, E.,
The association behavior of isomeric straight-chain and branched-chain octanols,
Z. Phys. Chem. (Munich), 1962, 32, 330-9. [all data]
Kallina and Kuffner, 1960
Kallina; Kuffner,
Monatsh. Chem., 1960, 91, 289. [all data]
Woods and Viola, 1956
Woods, G.F.; Viola, A.,
J. Am. Chem. Soc., 1956, 78, 4380. [all data]
Dorough, Glass, et al., 1941
Dorough, G.L.; Glass, H.B.; Gresham, T.L.; Malone, G.B.; Reid, E.E.,
Structure-property relationships in some isomeric octanols,
J. Am. Chem. Soc., 1941, 63, 3100. [all data]