Dibenz(a,h)acridine
- Formula: C21H13N
- Molecular weight: 279.3346
- IUPAC Standard InChIKey: JNCSIWAONQTVCF-UHFFFAOYSA-N
- CAS Registry Number: 226-36-8
- Chemical structure:
View 3d structure (requires JavaScript / HTML 5) - Other names: 7-Azadibenz(a,h)anthracene; Db(a,h)ac; Dibenz(a,d)acridine; 1,2,5,6-Dibenzacridine; 1,2,5,6-Dibenzoacridine; Dibenzo[a,H]acridine

Phase change data

Data compiled by: William E. Acree, Jr., James S. Chickos
Enthalpy of fusion
ΔfusH (kJ/mol) | Temperature (K) | Method | Reference |
---|---|---|---|
30.6 | 499.7 | DSC | Kestens, Auclair, et al., 2010 |

Van Den Dool and Kratz RI, non-polar column, temperature ramp

Column type | Active phase | I | Reference | Comment |
---|---|---|---|---|
Capillary | SE-52 | 3047. | Beernaert, 1979 | He, 50. C @ 5. min, 6. K/min; Column length: 33.3 m; Column diameter: 0.50 mm; Tend: 320. C |

Lee's RI, non-polar column, temperature ramp

Column type | Active phase | I | Reference | Comment |
---|---|---|---|---|
Capillary | SE-52 | 488.55 | Vassilaros, Kong, et al., 1982 | 20. m/0.30 mm/0.25 μm, H2, 40. C @ 2. min, 4. K/min; Tend: 265. C |

References

Kestens, Auclair, et al., 2010
Kestens, Vikram; Auclair, Guy; Drozdzewska, Katarzyna; Held, Andrea; Roebben, Gert; Linsinger, Thomas,
Thermodynamic property values of selected polycyclic aromatic hydrocarbons measured by differential scanning calorimetry,
J Therm Anal Calorim, 2010, 99, 1, 245-261, https://doi.org/10.1007/s10973-009-0440-6
. [all data]
Beernaert, 1979
Beernaert, H.,
Gas Chromatographic Analysis of Polyclylic Aromatic Hydrocarbons,
J. Chromatogr., 1979, 173, 1, 109-118, https://doi.org/10.1016/S0021-9673(01)80450-7
. [all data]
Vassilaros, Kong, et al., 1982
Vassilaros, D.L.; Kong, R.C.; Later, D.W.; Lee, M.L.,
Linear retention index system for polycyclic aromatic compounds. Critical evaluation and additional indices,
J. Chromatogr., 1982, 252, 1-20, https://doi.org/10.1016/S0021-9673(01)88394-1
. [all data]