Tricyclo[3.3.1.13,7]decan-1-ol, acetate
- Formula: C12H18O2
- Molecular weight: 194.2701
- IUPAC Standard InChIKey: ZYLRDAOEBRPIGT-UHFFFAOYSA-N
- CAS Registry Number: 22635-62-7
- Chemical structure:
View 3d structure (requires JavaScript / HTML 5) - Species with the same structure:
- Other names: Tricyclo[3.3.1.13,7]decan-1-ol, acetate

Reaction thermochemistry data

Data compiled by: Hussein Y. Afeefy, Joel F. Liebman, and Stephen E. Stein
Individual Reactions
By formula: C10H14 + C2H4O2 = C12H18O2
Quantity | Value | Units | Method | Reference | Comment |
---|---|---|---|---|---|
ΔrH° | -182.0 ± 0.3 | kJ/mol | Cac | Wiberg, Connon, et al., 1979 | liquid phase; solvent: Acetic acid |

References

Wiberg, Connon, et al., 1979
Wiberg, K.B.; Connon, H.A.; Pratt, W.E.,
Enthalpies of acetolysis of tricyclo[3.2.1.01,5]octane ([3.2.1]propellane) and 1,3-dehydroadamantane,
J. Am. Chem. Soc., 1979, 101, 6970-6972. [all data]