cis-p-Mentha-1(7),8-dien-2-ol
- Formula: C10H16O
- Molecular weight: 152.2334
- IUPAC Standard InChIKey: PNVTXOFNJFHXOK-UWVGGRQHSA-N
- CAS Registry Number: 22626-43-3
- Chemical structure:
View 3d structure (requires JavaScript / HTML 5) - Stereoisomers:
- Other names: cis-p-Mentha-1(7),8-diene-2-ol; cis-1(7),8-p-Menthadien-2-ol; 2R,4R-p-Mentha-1(7),8-dien-2-ol; cis-para-Mentha-1(7), 8-dien-2-ol; cis-Mentha-1(7),8-dien-2-ol

Van Den Dool and Kratz RI, non-polar column, temperature ramp

Column type | Active phase | I | Reference | Comment |
---|---|---|---|---|
Capillary | DB-5 | 1231. | Su, Ho, et al., 2006 | 30. m/0.25 mm/0.25 μm, He, 50. C @ 2. min, 5. K/min; Tend: 250. C |
Capillary | CP Sil 5 CB | 1204. | Pino, Marbot, et al., 2002 | 25. m/0.25 mm/0.25 μm, N2, 60. C @ 6. min, 4. K/min; Tend: 280. C |

Van Den Dool and Kratz RI, polar column, temperature ramp

Column type | Active phase | I | Reference | Comment |
---|---|---|---|---|
Capillary | DB-Wax | 1888. | Brophy, Goldsack, et al., 1998 | He, 3. K/min; Column length: 60. m; Column diameter: 0.32 mm; Tstart: 35. C; Tend: 220. C |

Normal alkane RI, non-polar column, temperature ramp

Column type | Active phase | I | Reference | Comment |
---|---|---|---|---|
Capillary | BP-1 | 1204. | Boti, Muselli, et al., 2006 | 50. m/0.22 mm/0.25 μm, He, 2. K/min, 220. C @ 20. min; Tstart: 60. C |
Capillary | HP-5 | 1235. | Coronel, Cerda-Garcia-Rojas, et al., 2006 | 30. m/0.32 mm/0.25 μm, He, 3. K/min; Tstart: 60. C; Tend: 246. C |
Capillary | RTX-1 | 1206. | Cavalli, Tomi, et al., 2004 | 60. m/0.22 mm/0.25 μm, He, 2. K/min, 230. C @ 45. min; Tstart: 60. C |

Normal alkane RI, non-polar column, custom temperature program

Column type | Active phase | I | Reference | Comment |
---|---|---|---|---|
Capillary | CP Sil 8 CB | 1231. | Butkienë, Nivinskienë, et al., 2005 | 50. m/0.32 mm/0.25 μm, He; Program: 50C(5min) => 2C/min => 90C => 15C/min => 240C(4min) |
Capillary | SE-30 | 1198. | Vinogradov, 2004 | Program: not specified |
Capillary | CP Sil 5 CB | 1205. | Weyerstahl, Marschall, et al., 1997 | N2; Column length: 30. m; Column diameter: 0.25 mm; Program: not specified |
Capillary | Polydimethyl siloxanes | 1198. | Zenkevich, 1997 | Program: not specified |

Normal alkane RI, polar column, temperature ramp

Column type | Active phase | I | Reference | Comment |
---|---|---|---|---|
Capillary | BP-20 | 1885. | Boti, Muselli, et al., 2006 | 50. m/0.22 mm/0.25 μm, He, 2. K/min, 220. C @ 20. min; Tstart: 60. C |
Capillary | RTX-Wax | 1871. | Cavalli, Tomi, et al., 2004 | 60. m/0.22 mm/0.25 μm, He, 2. K/min, 230. C @ 45. min; Tstart: 60. C |
Capillary | BP-20 | 1903. | Dunlop, Bignell, et al., 2003 | 25. m/0.33 mm/0.5 μm, H2, 5. K/min; Tstart: 80. C; Tend: 220. C |
Capillary | BP-20 | 1903. | Bignell, Dunlop, et al., 1998 | 25. m/0.33 mm/0.5 μm, H2, 5. K/min; Tstart: 80. C; Tend: 220. C |
Capillary | BP-20 | 1903. | Bignell, Dunlop, et al., 1997 | 25. m/0.33 mm/0.5 μm, H2, 5. K/min; Tstart: 80. C; Tend: 220. C |
Capillary | BP-20 | 1903. | Bignell, Dunlop, et al., 1997, 2 | 25. m/0.33 mm/0.5 μm, H2, 5. K/min; Tstart: 80. C; Tend: 220. C |
Capillary | BP-20 | 1903. | Bignell, Dunlop, et al., 1997, 3 | 25. m/0.33 mm/0.5 μm, H2, 5. K/min; Tstart: 80. C; Tend: 220. C |
Capillary | BP-20 | 1903. | Bignell, Dunlop, et al., 1997, 4 | 25. m/0.33 mm/0.5 μm, H2, 5. K/min; Tstart: 80. C; Tend: 220. C |
Capillary | BP-20 | 1903. | Bignell, Dunlop, et al., 1997, 5 | 25. m/0.33 mm/0.5 μm, 5. K/min; Tstart: 80. C; Tend: 220. C |
Capillary | BP-20 | 1903. | Bignell, Dunlop, et al., 1997, 6 | 25. m/0.33 mm/0.5 μm, H2, 5. K/min; Tstart: 80. C; Tend: 220. C |

Normal alkane RI, polar column, custom temperature program

Column type | Active phase | I | Reference | Comment |
---|---|---|---|---|
Capillary | HP-Innowax FSC | 1896. | Viljoen, Subramoney, et al., 2005 | 60. m/0.25 mm/0.25 μm, He; Program: 60C(10min) => 4C/min => 220C(10min) => 1C/min => 240C |
Capillary | Innowax FSC | 1896. | Baser, Demirci, et al., 2003 | 60. m/0.25 mm/0.25 μm, He; Program: 60C(10min) => 4C/min => 220C (10min) => 1C/min => 240C |
Capillary | HP-Innowax FSC | 1896. | Demirci, Baser, et al., 2003 | 60. m/0.25 mm/0.25 μm, He; Program: 60C (10min) => 4C/min => 220C (10min) => 1C/min => 240C |
Capillary | Innowax | 1896. | Baser, Nuriddinov, et al., 2002 | 60. m/0.25 mm/0.25 μm, He; Program: 60C(10min) => 4C/min => 220C(10min) => 1C/min => 240C |
Capillary | HP-Innowax | 1896. | Baser, Demirci, et al., 2001 | 60. m/0.25 mm/0.25 μm, He; Program: 60 0C (10 min) 10 K/min -> 220 0C (10 min) 1K/min -> 240 0C |
Capillary | HP-Innowax | 1896. | Gören, Demirci, et al., 2001 | 60. m/0.25 mm/0.25 μm, He; Program: 60 0C (10 min) 4 K/min -> 220 0C (10 min) 1 K/min -> 240 0C |
Capillary | Innowax | 1896. | Baser, Özek, et al., 2000 | 60. m/0.25 mm/0.25 μm, He; Program: 60 0C (10 min) 4 K/min -> 220 0C (10 min) 1 K/min -> 240 0C |

References

Su, Ho, et al., 2006
Su, Y.-C.; Ho, C.-L.; Wang, E.I.-C.; Chang, S.-T.,
Antifungal activities and chemical compositions of essential oils from leaves of four eucalypts,
Taiwan J. For. Sci., 2006, 21, 1, 49-61. [all data]
Pino, Marbot, et al., 2002
Pino, J.A.; Marbot, R.; Quert, R.; García, H.,
Study of essential oils of Eucalyptus resinifera Smith, E. tereticornis Smith and Corymbia maculata (Hook.) K.D. Hill L.A.S. Johnson, grown in Cuba,
Flavour Fragr. J., 2002, 17, 1, 1-4, https://doi.org/10.1002/ffj.1026
. [all data]
Brophy, Goldsack, et al., 1998
Brophy, J.J.; Goldsack, R.J.; Bean, A.R.; Forster, P.I.; Lepschi, B.J.,
Leaf essential oils of the genus Leptospermum (Myrtaceae) in eastern Australia. Part 2. Leptospermum blakelyi and allies,
Flavour Fragr. J., 1998, 13, 5, 353-358, https://doi.org/10.1002/(SICI)1099-1026(1998090)13:5<353::AID-FFJ759>3.0.CO;2-1
. [all data]
Boti, Muselli, et al., 2006
Boti, J.B.; Muselli, A.; Tomi, F.; Koukoua, G.; N'Guessan, T.Y.; Costa, J.; Casanova, J.,
Combined analysis of Cymbopogon giganteus Chiov. leaf oil from Ivory Coast by GC/RI, GC/MS and 13C-NMR,
C.R. Chim., 2006, 9, 1, 164-168, https://doi.org/10.1016/j.crci.2005.10.003
. [all data]
Coronel, Cerda-Garcia-Rojas, et al., 2006
Coronel, A. del.C.; Cerda-Garcia-Rojas, C.M.; Joseph-Nathan, P.; Catalán, C.A.N.,
Chemical composition, seasonal variation and a new sesquiterpene alcohol from the essential oil of Lippia integrifolia,
Flavour Fragr. J., 2006, 21, 5, 839-847, https://doi.org/10.1002/ffj.1736
. [all data]
Cavalli, Tomi, et al., 2004
Cavalli, J.-F.; Tomi, F.; Bernardini, A.-F.; Casanova, J.,
Combined Analysis of the Essential Oil of Chenopodium ambrosioides by GC, GC-MS and 13C-NMR Spectroscopy: Quantitative Determination of Ascaridole, a Heat-sensitive Compound,
Phytochem. Anal., 2004, 15, 5, 275-279, https://doi.org/10.1002/pca.761
. [all data]
Butkienë, Nivinskienë, et al., 2005
Butkienë, R.; Nivinskienë, O.; Mockutë, D.,
α-Pinene chemotype of leaf (needle) essential oils of Juniperus communis L. growing wild in Vilnius district,
Chemija, 2005, 16, 1, 53-60. [all data]
Vinogradov, 2004
Vinogradov, B.A.,
Production, composition, properties and application of essential oils, 2004, retrieved from http://viness.narod.ru. [all data]
Weyerstahl, Marschall, et al., 1997
Weyerstahl, P.; Marschall, H.; Seelmann, I.; Rustaiyan, A.,
Constituents of the essential oil of Achillea eriophora DC,
Flavour Fragr. J., 1997, 12, 2, 71-78, https://doi.org/10.1002/(SICI)1099-1026(199703)12:2<71::AID-FFJ620>3.0.CO;2-E
. [all data]
Zenkevich, 1997
Zenkevich, I.G.,
Analytical Parameters of Components of Essential Oils for their Chromatographic and Chromato-Spectral Identificaiton. Oxsigenated derivatives of Mono- and Sesquiterpene Hydrocarbons,
Rastit, Resursy (Rus.), 1997, 33, 1, 16-28. [all data]
Dunlop, Bignell, et al., 2003
Dunlop, P.J.; Bignell, C.M.; Hibbert, D.B.; Brooker, M.I.H.,
Use of gas chromatograms of the essential leaf oils of the genus Eucalyptus for taxonomic purposes: E. subser. Euglobulares (Blakely),
Flavour Fragr. J., 2003, 18, 2, 162-169, https://doi.org/10.1002/ffj.1190
. [all data]
Bignell, Dunlop, et al., 1998
Bignell, C.M.; Dunlop, P.J.; Brophy, J.J.,
Volatile leaf oils of some South-Western and Southern Australian species of the genus Eucalyptus (Series 1). Part XIX,
Flavour Fragr. J., 1998, 13, 2, 131-139, https://doi.org/10.1002/(SICI)1099-1026(199803/04)13:2<131::AID-FFJ710>3.0.CO;2-X
. [all data]
Bignell, Dunlop, et al., 1997
Bignell, C.M.; Dunlop, P.J.; Brophy, J.J.; Fookes, C.J.R.,
Volatile leaf oils of some South-Western and Southern Australian species of the genus Eucalyptus (Series I). Part XIV: Subgenus Monocalyptus,
Flavour Fragr. J., 1997, 12, 3, 177-183, https://doi.org/10.1002/(SICI)1099-1026(199705)12:3<177::AID-FFJ626>3.0.CO;2-9
. [all data]
Bignell, Dunlop, et al., 1997, 2
Bignell, C.M.; Dunlop, P.J.; Brophy, J.J.,
Volatile leaf oils of some South-Western and Southern Australian species of the genus Eucalyptus (Series I). Part XV: Subgenus symphyomyrtus, section bisectaria, series levispermae,
Flavour Fragr. J., 1997, 12, 3, 185-193, https://doi.org/10.1002/(SICI)1099-1026(199705)12:3<185::AID-FFJ627>3.0.CO;2-B
. [all data]
Bignell, Dunlop, et al., 1997, 3
Bignell, C.M.; Dunlop, P.J.; Brophy, J.J.,
Volatile leaf oils of some South-Western and Southern Australian species of the genus Eucalyptus (Series I). Part XVI: Subgenus symphyomyrtus, section bisectaria, series cneorifoliae, series porantherae and series falcatae,
Flavour Fragr. J., 1997, 12, 261-267. [all data]
Bignell, Dunlop, et al., 1997, 4
Bignell, C.M.; Dunlop, P.J.; Brophy, J.J.,
Volatile leaf oils of some South-Western and Southern Australian species of the genus Eucalyptus (Series I). Part XVII: Subgenus symphyomyrtus (i) section bisectaria, series calycogonae and (ii) section dumaria, series dumosae, series rigentes and series ovulares,
Flavour Fragr. J., 1997, 12, 269-275. [all data]
Bignell, Dunlop, et al., 1997, 5
Bignell, C.M.; Dunlop, P.J.; Brophy, J.J.,
Volatile leaf oils of some Queensland and Norther Australian species of the genus Eucalyptus (Series II) Part II. Subgenera (a) Blakella, (b) Corymbia, (c) Unnamed, (d) Idiogenes, (e) Monocalyptus and (f) Symphyomyrtus,
Flavour Fragr. J., 1997, 12, 4, 277-284, https://doi.org/10.1002/(SICI)1099-1026(199707)12:4<277::AID-FFJ642>3.0.CO;2-B
. [all data]
Bignell, Dunlop, et al., 1997, 6
Bignell, C.M.; Dunlop, P.J.; Brophy, J.J.,
Volatile leaf oils of some south-western and southern Australian speices of the genus Eucalyptus (Series I). Part XVIII. A. Subgenus monocalyptus. B. Subgenus Symphyomyrtus: (i) section Guilfoyleanae; (ii) section bisectaria, series accedentes, series occidentales, series levispermae, series loxophlebae, series macrocarpae, series orbifoliae, series calycogonae; (iii) section dumaria, series incrassatae and series ovulares,
Flavour Fragr. J., 1997, 12, 423-432. [all data]
Viljoen, Subramoney, et al., 2005
Viljoen, A.M.; Subramoney, S.; van Vuuren, S.F.; Baser, K.H.C.; Demirci, B.,
The composition, geographical variation and antimicrobial activity of Lippia javanica (Verbenaceae) leaf essential oils,
J. Ethnopharmacol., 2005, 96, 1-2, 271-277, https://doi.org/10.1016/j.jep.2004.09.017
. [all data]
Baser, Demirci, et al., 2003
Baser, K.H.C.; Demirci, B.; Dekebo, A.; Dagne, E.,
Essential oils of some Boswellia spp., myrrh and opopanax,
Flavour Fragr. J., 2003, 18, 2, 153-156, https://doi.org/10.1002/ffj.1166
. [all data]
Demirci, Baser, et al., 2003
Demirci, B.; Baser, K.H.C.; Yildiz, B.; Bahcecioglu, Z.,
Composition of the essential oils of six endemic Salvia spp. from Turkey,
Flavour Fragr. J., 2003, 18, 2, 116-121, https://doi.org/10.1002/ffj.1173
. [all data]
Baser, Nuriddinov, et al., 2002
Baser, K.H.C.; Nuriddinov, H.R.; Ozek, T.; Demirci, A.B.; Azcan, N.; Nigmatullaev, A.M.,
Essential oil of Arischrada korolkowii from the Chatkal mountains of Uzbekistan,
Chem. Nat. Compd. (Engl. Transl.), 2002, 38, 1, 51-53, https://doi.org/10.1023/A:1015729731464
. [all data]
Baser, Demirci, et al., 2001
Baser, K.H.C.; Demirci, B.; Tabanca, N.; Özek, T.; Gören, N.,
Composition of the essential oils of Tanacetum armenum (DC.) Schultz Bip., T. balsamita L., T. chiliophyllum (Fisch. Mey.) Schultz Bip. var. chiliophyllum and T. haradjani (Rech. fil.) Grierson and the enantiomeric distribution of camphor and carvone,
Flavour Fragr. J., 2001, 16, 3, 195-200, https://doi.org/10.1002/ffj.977
. [all data]
Gören, Demirci, et al., 2001
Gören, N.; Demirci, B.; Baser, K.H.C.,
Composition of the essential oils of Tanacetum spp. from Turkey,
Flavour Fragr. J., 2001, 16, 3, 191-194, https://doi.org/10.1002/ffj.976
. [all data]
Baser, Özek, et al., 2000
Baser, K.H.C.; Özek, T.; Demirci, B.; Duman, H.,
Composition of the essential oil of Glaucosciadium cordifolium (Boiss.) Burtt et Davis from Turkey,
Flavour Fragr. J., 2000, 15, 1, 45-46, https://doi.org/10.1002/(SICI)1099-1026(200001/02)15:1<45::AID-FFJ867>3.0.CO;2-L
. [all data]