2-Butanone, 1,1-dichloro-3,3-dimethyl-
- Formula: C6H10Cl2O
- Molecular weight: 169.049
- IUPAC Standard InChIKey: UDWZXMQIEHAAQT-UHFFFAOYSA-N
- CAS Registry Number: 22591-21-5
- Chemical structure:
View 3d structure (requires JavaScript / HTML 5) - Other names: 1,1-Dichloro-3,3-dimethyl-2-butanone; Dichloromethyl tert-butyl ketone; Dichloropinacolin; α,α-Dichloropinacolin; Dichloropinakolin; ω,ω-Dichlorpinakolin; 1,1-dichloro-3,3-dimethylbutan-2-one

Phase change data

Data compiled by: Thermodynamics Research Center, NIST Boulder Laboratories, Chris Muzny director
Quantity | Value | Units | Method | Reference | Comment |
---|---|---|---|---|---|
Tfus | 321.2 | K | N/A | Vorontsova and Vlasov, 1987 | Crystal phase 1 phase; Uncertainty assigned by TRC = 0.5 K |
Tfus | 324. | K | N/A | Hill and Kropa, 1933 | Uncertainty assigned by TRC = 2. K |

References

Vorontsova and Vlasov, 1987
Vorontsova, N.A.; Vlasov, O.N.,
Determination of saturated vapor pressure of Bayletone and its semiproducts,
Deposited Doc. ONIITEkhim Cherkassy, 1987, Doc. No. 1423 khp - 87, 1987. [all data]
Hill and Kropa, 1933
Hill, G.A.; Kropa, E.L.,
Some Halogented Pinacalones,
J. Am. Chem. Soc., 1933, 55, 2509. [all data]