p-tert-Butylpivalophenone
- Formula: C15H22O
- Molecular weight: 218.3346
- IUPAC Standard InChIKey: ZISXBXYWRHTLEN-UHFFFAOYSA-N
- CAS Registry Number: 22583-66-0
- Chemical structure:
View 3d structure (requires JavaScript / HTML 5) - Permanent link for this species. Use this link for bookmarking this species for future reference.

Phase change data

Data compiled by: Robert L. Brown and Stephen E. Stein
Reduced pressure boiling point
Tboil (K) | Pressure (bar) | Reference |
---|---|---|
392. to 395. | 0.005 | Frinton Laboratories Inc., 1986 |

References

Frinton Laboratories Inc., 1986
Frinton Laboratories Inc.,
Catalog Number 11, Frinton Laboratories Inc., Vineland, NJ, 1986, 99. [all data]