1,2-dibromo-[1,1,2,2-2H4]ethane
- Formula: C2D4Br2
- Molecular weight: 191.886
- IUPAC Standard InChIKey: PAAZPARNPHGIKF-LNLMKGTHSA-N
- CAS Registry Number: 22581-63-1
- Chemical structure:
View 3d structure (requires JavaScript / HTML 5) - Isotopologues:
- Other names: 1,2-Dibromoethane-d4

Condensed phase thermochemistry data

Data compiled by: Eugene S. Domalski and Elizabeth D. Hearing
Constant pressure heat capacity of liquid
Cp,liquid (J/mol*K) | Temperature (K) | Reference |
---|---|---|
147.5 | 293. | D'hont and Jungers, 1949 |
149.12 | 310. | Wuyts and Jungers, 1949 |

References

D'hont and Jungers, 1949
D'hont, M.; Jungers, J.C.,
La chaleur molaire des 1,1'-dibromethanes et 1,1',2-tribromethanes en phase liquide,
Bull. Soc. Chim. Belg., 1949, 58, 196-204. [all data]
Wuyts and Jungers, 1949
Wuyts, J.; Jungers, J.C.,
Les chaleurs molaires des bibromures de deuteroethylene,
Bull. Soc. Chim. Belg., 1949, 58, 80-86. [all data]