1,4-p-Menthadien-7-al
- Formula: C10H14O
- Molecular weight: 150.2176
- IUPAC Standard InChIKey: NIBUJHLMVJZODW-UHFFFAOYSA-N
- CAS Registry Number: 22580-90-1
- Chemical structure:
View 3d structure (requires JavaScript / HTML 5) - Other names: 1,4-Cyclohexadiene-1-carboxaldehyde, 4-(1-methylethyl)-; 1,4-Cyclohexadiene-1-carboxaldehyde, 4-isopropyl-; 4-Isopropylcyclohexa-1,4-diene-1-carboxaldehyde; 4-Isopropylcyclohexa-1,4-dienecarbaldehyde; p-Mentha-1,4-dien-7-al; γ-Terpinen-7-al; Dihydrocuminic aldehyde

Kovats' RI, non-polar column, temperature ramp

Column type | Active phase | I | Reference | Comment |
---|---|---|---|---|
Capillary | SPB-1 | 1267. | Behera, Nagarajan, et al., 2004 | 30. m/0.32 mm/0.25 μm, He, 50. C @ 2. min, 2. K/min, 250. C @ 5. min |

Van Den Dool and Kratz RI, non-polar column, custom temperature program

Column type | Active phase | I | Reference | Comment |
---|---|---|---|---|
Capillary | HP-5MS | 1297.6 | Andriamaharavo, 2014 | 30. m/0.25 mm/0.25 μm, He; Program: 60C (1 min) => 5 C/min => 210C => 10 C/min => 280C (15 min) |

Normal alkane RI, non-polar column, temperature ramp

Column type | Active phase | I | Reference | Comment |
---|---|---|---|---|
Capillary | DB-5 | 1278. | Askari and Sefidkon, 2006 | 30. m/0.25 mm/0.25 μm, He, 40. C @ 5. min, 4. K/min; Tend: 260. C |
Capillary | DB-1 | 1274. | Eikani, Goodarznia, et al., 1999 | 60. m/0.25 mm/0.25 μm, He, 4. K/min; Tstart: 50. C; Tend: 230. C |

Normal alkane RI, non-polar column, custom temperature program

Column type | Active phase | I | Reference | Comment |
---|---|---|---|---|
Capillary | SE-30 | 1276. | Vinogradov, 2004 | Program: not specified |
Capillary | SE-30 | 1272. | Vinogradov, 2004 | Program: not specified |
Capillary | Polydimethyl siloxanes | 1276. | Zenkevich, 1997 | Program: not specified |
Capillary | Polydimethyl siloxanes | 1272. | Zenkevich, 1997 | Program: not specified |

References

Behera, Nagarajan, et al., 2004
Behera, S.; Nagarajan, S.; Rao, L.J.M.,
Microwave heating and conventional roasting of cumin seeds (Cuminum cyminum L.) and effect on chemical composition of volatiles,
Food Chem., 2004, 87, 1, 25-29, https://doi.org/10.1016/j.foodchem.2003.10.012
. [all data]
Andriamaharavo, 2014
Andriamaharavo, N.R.,
Retention Data. NIST Mass Spectrometry Data Center., NIST Mass Spectrometry Data Center, 2014. [all data]
Askari and Sefidkon, 2006
Askari, F.; Sefidkon, F.,
Essential oil composition of Pimpinella affinis Ledeb. from two localities in Iran,
Flavour Fragr. J., 2006, 21, 5, 754-756, https://doi.org/10.1002/ffj.1619
. [all data]
Eikani, Goodarznia, et al., 1999
Eikani, M.H.; Goodarznia, I.; Mirza, M.,
Supercritical carbon dioxide extraction of cumin seeds (Cuminum cyminum L.),
Flavour Fragr. J., 1999, 14, 1, 29-31, https://doi.org/10.1002/(SICI)1099-1026(199901/02)14:1<29::AID-FFJ765>3.0.CO;2-G
. [all data]
Vinogradov, 2004
Vinogradov, B.A.,
Production, composition, properties and application of essential oils, 2004, retrieved from http://viness.narod.ru. [all data]
Zenkevich, 1997
Zenkevich, I.G.,
Analytical Parameters of Components of Essential Oils for their Chromatographic and Chromato-Spectral Identificaiton. Oxsigenated derivatives of Mono- and Sesquiterpene Hydrocarbons,
Rastit, Resursy (Rus.), 1997, 33, 1, 16-28. [all data]