N,N-Dimethylaminodiborane

Phase change data

Data compiled by: Eugene S. Domalski and Elizabeth D. Hearing

Temperature of phase transition

Ttrs (K) Initial Phase Final Phase Reference Comment
218.4crystaline, IliquidFurukawa, McCoskey, et al., 1955

Enthalpy of phase transition

ΔHtrs (kJ/mol) Temperature (K) Initial Phase Final Phase Reference Comment
7.794199.9crystaline, IIcrystaline, IFurukawa, McCoskey, et al., 1955

References

Furukawa, McCoskey, et al., 1955
Furukawa, G.T.; McCoskey, R.E.; Reilly, M.L.; Harman, A.W., Heat capacity; heats of fusion, vaporization, and transition; and vapor pressure of N-dimethylaminodiborane, J. Research, 1955, NBS 55(4), 201-207. [all data]