Mercury cation
- Formula: Hg+
- Molecular weight: 200.59
- CAS Registry Number: 22542-11-6

Gas phase thermochemistry data

Quantity | Value | Units | Method | Reference | Comment |
---|---|---|---|---|---|
S°gas,1 bar | 53.685 | cal/mol*K | Review | Chase, 1998 | Data last reviewed in September, 1984 |

Ion clustering data

Data compiled by: Michael M. Meot-Ner (Mautner) and Sharon G. Lias
Clustering reactions
By formula: Hg+ + Ar = (Hg+ • Ar)
Quantity | Value | Units | Method | Reference | Comment |
---|---|---|---|---|---|
ΔrH° | 5.3 ± 0.4 | kcal/mol | PI | Linn, Brom, et al., 1985 | gas phase |
By formula: Hg+ + Hg = (Hg+ • Hg)
Quantity | Value | Units | Method | Reference | Comment |
---|---|---|---|---|---|
ΔrH° | 32. | kcal/mol | EI | Haberland, Kornmeier, et al., 1990 | gas phase; from graph |
By formula: (Hg+ • 4Hg) + Hg = (Hg+ • 5Hg)
Quantity | Value | Units | Method | Reference | Comment |
---|---|---|---|---|---|
ΔrH° | 4.6 | kcal/mol | EI | Haberland, Kornmeier, et al., 1990 | gas phase |
By formula: (Hg+ • 5Hg) + Hg = (Hg+ • 6Hg)
Quantity | Value | Units | Method | Reference | Comment |
---|---|---|---|---|---|
ΔrH° | 5.3 | kcal/mol | EI | Haberland, Kornmeier, et al., 1990 | gas phase; from graph |
By formula: (Hg+ • 6Hg) + Hg = (Hg+ • 7Hg)
Quantity | Value | Units | Method | Reference | Comment |
---|---|---|---|---|---|
ΔrH° | 4.8 | kcal/mol | EI | Haberland, Kornmeier, et al., 1990 | gas phase; from graph |
By formula: (Hg+ • 7Hg) + Hg = (Hg+ • 8Hg)
Quantity | Value | Units | Method | Reference | Comment |
---|---|---|---|---|---|
ΔrH° | 4.8 | kcal/mol | EI | Haberland, Kornmeier, et al., 1990 | gas phase; from graph |
By formula: (Hg+ • 8Hg) + Hg = (Hg+ • 9Hg)
Quantity | Value | Units | Method | Reference | Comment |
---|---|---|---|---|---|
ΔrH° | 4.8 | kcal/mol | EI | Haberland, Kornmeier, et al., 1990 | gas phase; from graph |
By formula: (Hg+ • 9Hg) + Hg = (Hg+ • 10Hg)
Quantity | Value | Units | Method | Reference | Comment |
---|---|---|---|---|---|
ΔrH° | 4.8 | kcal/mol | EI | Haberland, Kornmeier, et al., 1990 | gas phase; from graph |
By formula: (Hg+ • 10Hg) + Hg = (Hg+ • 11Hg)
Quantity | Value | Units | Method | Reference | Comment |
---|---|---|---|---|---|
ΔrH° | 5.3 | kcal/mol | EI | Haberland, Kornmeier, et al., 1990 | gas phase; from graph |
By formula: (Hg+ • 11Hg) + Hg = (Hg+ • 12Hg)
Quantity | Value | Units | Method | Reference | Comment |
---|---|---|---|---|---|
ΔrH° | 6.2 | kcal/mol | EI | Haberland, Kornmeier, et al., 1990 | gas phase; from graph |
By formula: (Hg+ • 12Hg) + Hg = (Hg+ • 13Hg)
Quantity | Value | Units | Method | Reference | Comment |
---|---|---|---|---|---|
ΔrH° | 6.5 | kcal/mol | EI | Haberland, Kornmeier, et al., 1990 | gas phase; from graph |
By formula: (Hg+ • 13Hg) + Hg = (Hg+ • 14Hg)
Quantity | Value | Units | Method | Reference | Comment |
---|---|---|---|---|---|
ΔrH° | 6.7 | kcal/mol | EI | Haberland, Kornmeier, et al., 1990 | gas phase; from graph |
By formula: (Hg+ • 14Hg) + Hg = (Hg+ • 15Hg)
Quantity | Value | Units | Method | Reference | Comment |
---|---|---|---|---|---|
ΔrH° | 6.9 | kcal/mol | EI | Haberland, Kornmeier, et al., 1990 | gas phase; from graph |
By formula: (Hg+ • 15Hg) + Hg = (Hg+ • 16Hg)
Quantity | Value | Units | Method | Reference | Comment |
---|---|---|---|---|---|
ΔrH° | 7.1 | kcal/mol | EI | Haberland, Kornmeier, et al., 1990 | gas phase; from graph |
By formula: (Hg+ • 16Hg) + Hg = (Hg+ • 17Hg)
Quantity | Value | Units | Method | Reference | Comment |
---|---|---|---|---|---|
ΔrH° | 7.8 | kcal/mol | EI | Haberland, Kornmeier, et al., 1990 | gas phase; from graph |
By formula: (Hg+ • 17Hg) + Hg = (Hg+ • 18Hg)
Quantity | Value | Units | Method | Reference | Comment |
---|---|---|---|---|---|
ΔrH° | 8.3 | kcal/mol | EI | Haberland, Kornmeier, et al., 1990 | gas phase; from graph |
By formula: (Hg+ • 18Hg) + Hg = (Hg+ • 19Hg)
Quantity | Value | Units | Method | Reference | Comment |
---|---|---|---|---|---|
ΔrH° | 8.8 | kcal/mol | EI | Haberland, Kornmeier, et al., 1990 | gas phase; from graph |
By formula: (Hg+ • 19Hg) + Hg = (Hg+ • 20Hg)
Quantity | Value | Units | Method | Reference | Comment |
---|---|---|---|---|---|
ΔrH° | 9.7 | kcal/mol | EI | Haberland, Kornmeier, et al., 1990 | gas phase; from graph |
By formula: (Hg+ • 20Hg) + Hg = (Hg+ • 21Hg)
Quantity | Value | Units | Method | Reference | Comment |
---|---|---|---|---|---|
ΔrH° | 10.2 | kcal/mol | EI | Haberland, Kornmeier, et al., 1990 | gas phase; from graph |
By formula: (Hg+ • 21Hg) + Hg = (Hg+ • 22Hg)
Quantity | Value | Units | Method | Reference | Comment |
---|---|---|---|---|---|
ΔrH° | 10.6 | kcal/mol | EI | Haberland, Kornmeier, et al., 1990 | gas phase; from graph |
By formula: (Hg+ • 22Hg) + Hg = (Hg+ • 23Hg)
Quantity | Value | Units | Method | Reference | Comment |
---|---|---|---|---|---|
ΔrH° | 11.1 | kcal/mol | EI | Haberland, Kornmeier, et al., 1990 | gas phase; from graph |
By formula: (Hg+ • 23Hg) + Hg = (Hg+ • 24Hg)
Quantity | Value | Units | Method | Reference | Comment |
---|---|---|---|---|---|
ΔrH° | 11.3 | kcal/mol | EI | Haberland, Kornmeier, et al., 1990 | gas phase; from graph |

Reaction thermochemistry data

Data compiled by: Michael M. Meot-Ner (Mautner) and Sharon G. Lias

Individual Reactions

(Hg+ • 20mercury) + mercury = (Hg+ • 21mercury)

By formula: (Hg+ • 20Hg) + Hg = (Hg+ • 21Hg)

Quantity Value Units Method Reference Comment
Δr42.7kJ/molEIHaberland, Kornmeier, et al., 1990gas phase; from graph

(Hg+ • 21mercury) + mercury = (Hg+ • 22mercury)

By formula: (Hg+ • 21Hg) + Hg = (Hg+ • 22Hg)

Quantity Value Units Method Reference Comment
Δr44.4kJ/molEIHaberland, Kornmeier, et al., 1990gas phase; from graph

(Hg+ • 22mercury) + mercury = (Hg+ • 23mercury)

By formula: (Hg+ • 22Hg) + Hg = (Hg+ • 23Hg)

Quantity Value Units Method Reference Comment
Δr46.4kJ/molEIHaberland, Kornmeier, et al., 1990gas phase; from graph

(Hg+ • 23mercury) + mercury = (Hg+ • 24mercury)

By formula: (Hg+ • 23Hg) + Hg = (Hg+ • 24Hg)

Quantity Value Units Method Reference Comment
Δr47.3kJ/molEIHaberland, Kornmeier, et al., 1990gas phase; from graph

(Hg+ • 10mercury) + mercury = (Hg+ • 11mercury)

By formula: (Hg+ • 10Hg) + Hg = (Hg+ • 11Hg)

Quantity Value Units Method Reference Comment
Δr22.kJ/molEIHaberland, Kornmeier, et al., 1990gas phase; from graph

(Hg+ • 11mercury) + mercury = (Hg+ • 12mercury)

By formula: (Hg+ • 11Hg) + Hg = (Hg+ • 12Hg)

Quantity Value Units Method Reference Comment
Δr26.kJ/molEIHaberland, Kornmeier, et al., 1990gas phase; from graph

(Hg+ • 12mercury) + mercury = (Hg+ • 13mercury)

By formula: (Hg+ • 12Hg) + Hg = (Hg+ • 13Hg)

Quantity Value Units Method Reference Comment
Δr27.kJ/molEIHaberland, Kornmeier, et al., 1990gas phase; from graph

(Hg+ • 13mercury) + mercury = (Hg+ • 14mercury)

By formula: (Hg+ • 13Hg) + Hg = (Hg+ • 14Hg)

Quantity Value Units Method Reference Comment
Δr28.kJ/molEIHaberland, Kornmeier, et al., 1990gas phase; from graph

(Hg+ • 14mercury) + mercury = (Hg+ • 15mercury)

By formula: (Hg+ • 14Hg) + Hg = (Hg+ • 15Hg)

Quantity Value Units Method Reference Comment
Δr29.kJ/molEIHaberland, Kornmeier, et al., 1990gas phase; from graph

(Hg+ • 15mercury) + mercury = (Hg+ • 16mercury)

By formula: (Hg+ • 15Hg) + Hg = (Hg+ • 16Hg)

Quantity Value Units Method Reference Comment
Δr30.kJ/molEIHaberland, Kornmeier, et al., 1990gas phase; from graph

(Hg+ • 16mercury) + mercury = (Hg+ • 17mercury)

By formula: (Hg+ • 16Hg) + Hg = (Hg+ • 17Hg)

Quantity Value Units Method Reference Comment
Δr33.kJ/molEIHaberland, Kornmeier, et al., 1990gas phase; from graph

(Hg+ • 17mercury) + mercury = (Hg+ • 18mercury)

By formula: (Hg+ • 17Hg) + Hg = (Hg+ • 18Hg)

Quantity Value Units Method Reference Comment
Δr35.kJ/molEIHaberland, Kornmeier, et al., 1990gas phase; from graph

(Hg+ • 18mercury) + mercury = (Hg+ • 19mercury)

By formula: (Hg+ • 18Hg) + Hg = (Hg+ • 19Hg)

Quantity Value Units Method Reference Comment
Δr37.kJ/molEIHaberland, Kornmeier, et al., 1990gas phase; from graph

(Hg+ • 19mercury) + mercury = (Hg+ • 20mercury)

By formula: (Hg+ • 19Hg) + Hg = (Hg+ • 20Hg)

Quantity Value Units Method Reference Comment
Δr41.kJ/molEIHaberland, Kornmeier, et al., 1990gas phase; from graph

(Hg+ • 9mercury) + mercury = (Hg+ • 10mercury)

By formula: (Hg+ • 9Hg) + Hg = (Hg+ • 10Hg)

Quantity Value Units Method Reference Comment
Δr20.kJ/molEIHaberland, Kornmeier, et al., 1990gas phase; from graph

(Hg+ • 5mercury) + mercury = (Hg+ • 6mercury)

By formula: (Hg+ • 5Hg) + Hg = (Hg+ • 6Hg)

Quantity Value Units Method Reference Comment
Δr22.kJ/molEIHaberland, Kornmeier, et al., 1990gas phase; from graph

(Hg+ • 6mercury) + mercury = (Hg+ • 7mercury)

By formula: (Hg+ • 6Hg) + Hg = (Hg+ • 7Hg)

Quantity Value Units Method Reference Comment
Δr20.kJ/molEIHaberland, Kornmeier, et al., 1990gas phase; from graph

(Hg+ • 7mercury) + mercury = (Hg+ • 8mercury)

By formula: (Hg+ • 7Hg) + Hg = (Hg+ • 8Hg)

Quantity Value Units Method Reference Comment
Δr20.kJ/molEIHaberland, Kornmeier, et al., 1990gas phase; from graph

(Hg+ • 8mercury) + mercury = (Hg+ • 9mercury)

By formula: (Hg+ • 8Hg) + Hg = (Hg+ • 9Hg)

Quantity Value Units Method Reference Comment
Δr20.kJ/molEIHaberland, Kornmeier, et al., 1990gas phase; from graph

(Hg+ • 4mercury) + mercury = (Hg+ • 5mercury)

By formula: (Hg+ • 4Hg) + Hg = (Hg+ • 5Hg)

Quantity Value Units Method Reference Comment
Δr19.kJ/molEIHaberland, Kornmeier, et al., 1990gas phase

Hg+ + mercury = (Hg+ • mercury)

By formula: Hg+ + Hg = (Hg+ • Hg)

Quantity Value Units Method Reference Comment
Δr130.kJ/molEIHaberland, Kornmeier, et al., 1990gas phase; from graph

Hg+ + Argon = (Hg+ • Argon)

By formula: Hg+ + Ar = (Hg+ • Ar)

Quantity Value Units Method Reference Comment
Δr22. ± 2.kJ/molPILinn, Brom, et al., 1985gas phase

References

Chase, 1998
Chase, M.W., Jr.,
NIST-JANAF Themochemical Tables, Fourth Edition,
J. Phys. Chem. Ref. Data, Monograph 9, 1998, 1-1951. [all data]
Linn, Brom, et al., 1985
Linn, S.H.; Brom, J.M., Jr.; Tzeng, W.-B.; Ng, C.Y.,
Photoionization study of HgAr,
J. Chem. Phys., 1985, 82, 648. [all data]
Haberland, Kornmeier, et al., 1990
Haberland, H.; Kornmeier, H.; Langosh, H.; Oschwald, M.; Tanner, G.,
Experimental Study of the Transition from van der Waals, over Covalent to Metallic Bonding in Mercury Clusters,
J. Chem. Soc. Faraday Trans., 1990, 86, 13, 2473, https://doi.org/10.1039/ft9908602473
. [all data]