Tellurium
- Formula: Te
- Molecular weight: 127.60
- IUPAC Standard InChIKey: KPAKJCZNXLKDNP-UHFFFAOYSA-N
- CAS Registry Number: 22541-49-7
- Chemical structure:

Reaction thermochemistry data

Data compiled by: John E. Bartmess
Individual Reactions
(CAS Reg. No. 18282-39-8 • 4294967295) +
= CAS Reg. No. 18282-39-8
By formula: (CAS Reg. No. 18282-39-8 • 4294967295Te) + Te = CAS Reg. No. 18282-39-8
Quantity | Value | Units | Method | Reference | Comment |
---|---|---|---|---|---|
ΔrH° | 242. ± 9.2 | kJ/mol | Ther | Gal, Maria, et al., 1989 | gas phase |
ΔrH° | 386.1 ± 2.7 | kJ/mol | N/A | Freidhoff, Snodgrass, et al., 1986 | gas phase |
(CAS Reg. No. 64177-66-8 • 4294967295) +
= CAS Reg. No. 64177-66-8
By formula: (CAS Reg. No. 64177-66-8 • 4294967295Te) + Te = CAS Reg. No. 64177-66-8
Quantity | Value | Units | Method | Reference | Comment |
---|---|---|---|---|---|
ΔrH° | 220. ± 11. | kJ/mol | N/A | Snodgrass, Coe, et al., 1989 | gas phase |
(CAS Reg. No. 12269-53-3 • 4294967295) +
= CAS Reg. No. 12269-53-3
By formula: (CAS Reg. No. 12269-53-3 • 4294967295Te) + Te = CAS Reg. No. 12269-53-3
Quantity | Value | Units | Method | Reference | Comment |
---|---|---|---|---|---|
ΔrH° | 400. ± 21. | kJ/mol | N/A | Freidhoff, Coe, et al., 1986 | gas phase |

Gas phase ion energetics data

Data evaluated as indicated in comments:
L - Sharon G. Lias

Data compiled as indicated in comments:
LL - Sharon G. Lias and Joel F. Liebman
RDSH - Henry M. Rosenstock, Keith Draxl, Bruce W. Steiner, and John T. Herron
B - John E. Bartmess

Quantity Value Units Method Reference Comment
IE (evaluated)9.0096eVN/AN/AL

Electron affinity determinations

EA (eV) Method Reference Comment
1.97086LPDHaeffler, Klinkmüller, et al., 1996Given: 1.970876(7) eV; B
1.90 ± 0.20PDFeldmann, Rackwitx, et al., 1977B
1.97080 ± 0.00030LPDSlater and Linberger, 1977B

Ionization energy determinations

IE (eV) Method Reference Comment
9.0096EVALLide, 1992LL
8.9EISaha, Viswanathan, et al., 1988LL
9.0096SMoore, 1970RDSH

References

Gal, Maria, et al., 1989
Gal, J.-F.; Maria, P.-C.; Decouzon, M.,
The Gas-Phase Acidity and Bond Dissociation Energies of Hydrogen Telluride,
Int. J. Mass Spectrom. Ion Proc., 1989, 93, 1, 87, https://doi.org/10.1016/0168-1176(89)83076-9
. [all data]
Freidhoff, Snodgrass, et al., 1986
Freidhoff, C.B.; Snodgrass, J.T.; Coe, J.V.; McHugh, K.M.; Bowen, K.H.,
Negative ion photoelectron spectroscopy of TeH-,
J. Chem. Phys., 1986, 84, 1051. [all data]
Snodgrass, Coe, et al., 1989
Snodgrass, J.T.; Coe, J.V.; McHugh, K.M.; Freidhoff, C.B.; Bowen, K.H.,
Photoelectron Spectroscopy of the Selenium and Tellurium Containing Negative Ions: SeO2-, Se2- and Te2-,
J. Phys. Chem., 1989, 93, 4, 1249, https://doi.org/10.1021/j100341a016
. [all data]
Freidhoff, Coe, et al., 1986
Freidhoff, C.B.; Coe, J.V.; Snodgrass, J.T.; McHugh, K.M.; Bowen, K.H.,
Negative ion photoelectron spectroscopy of TeO-,
Chem. Phys. Lett., 1986, 124, 268. [all data]