D-Carvone
- Formula: C10H14O
- Molecular weight: 150.2176
- IUPAC Standard InChIKey: ULDHMXUKGWMISQ-SECBINFHSA-N
- CAS Registry Number: 2244-16-8
- Chemical structure:
View 3d structure (requires JavaScript / HTML 5) - Stereoisomers:
- Other names: D-(+)-Carvone; 2-Cyclohexen-1-one, 2-methyl-5-(1-methylethenyl)-, (S)-; p-Mentha-6,8-dien-2-one, (S)-(+)-; (+)-Carvone; (S)-(+)-Carvone; (S)-Carvone; Carvone, (+)-; d-p-Mentha-6,8(9)-dien-2-one; d-1-Methyl-4-isopropenyl-6-cyclohexen-2-one; 5-Isopropenyl-2-methyl-2-cyclohexen-1-one, (S)-; (S)-(+)-p-Mentha-6,8-dien-2-one; 2-Cyclohexen-1-one, 2-methyl-5-(1-methylethenyl)-, (5S)-; l-carvone; (+)-(4S)-carvone; (+)-Carvon; (S)-2-methyl-5-(1-methylvinyl)cyclohex-2-en-1-one

Phase change data

Data compiled as indicated in comments:
BS - Robert L. Brown and Stephen E. Stein
AC - William E. Acree, Jr., James S. Chickos
Quantity | Value | Units | Method | Reference | Comment |
---|---|---|---|---|---|
Tboil | 504.2 | K | N/A | Weast and Grasselli, 1989 | BS |
Quantity | Value | Units | Method | Reference | Comment |
ΔvapH° | 58.2 | kJ/mol | GC | Hoskovec, Grygarová, et al., 2005 | Based on data from 323. to 433. K.; AC |
Reduced pressure boiling point
Tboil (K) | Pressure (bar) | Reference | Comment |
---|---|---|---|
372.2 | 0.013 | Aldrich Chemical Company Inc., 1990 | BS |

Kovats' RI, non-polar column, isothermal

Column type | Active phase | Temperature (C) | I | Reference | Comment |
---|---|---|---|---|---|
Capillary | ZB-1 | 100. | 1212.83 | Hoskovec, Grygarová, et al., 2005 | 30. m/0.32 mm/0.25 μm, He |
Capillary | ZB-1 | 110. | 1216.93 | Hoskovec, Grygarová, et al., 2005 | 30. m/0.32 mm/0.25 μm, He |
Capillary | ZB-1 | 120. | 1221.14 | Hoskovec, Grygarová, et al., 2005 | 30. m/0.32 mm/0.25 μm, He |
Capillary | ZB-1 | 130. | 1225.42 | Hoskovec, Grygarová, et al., 2005 | 30. m/0.32 mm/0.25 μm, He |
Capillary | ZB-1 | 140. | 1229.89 | Hoskovec, Grygarová, et al., 2005 | 30. m/0.32 mm/0.25 μm, He |
Capillary | ZB-1 | 150. | 1234.47 | Hoskovec, Grygarová, et al., 2005 | 30. m/0.32 mm/0.25 μm, He |
Capillary | ZB-1 | 160. | 1239. | Hoskovec, Grygarová, et al., 2005 | 30. m/0.32 mm/0.25 μm, He |
Capillary | ZB-1 | 50. | 1194.54 | Hoskovec, Grygarová, et al., 2005 | 30. m/0.32 mm/0.25 μm, He |
Capillary | ZB-1 | 60. | 1197.94 | Hoskovec, Grygarová, et al., 2005 | 30. m/0.32 mm/0.25 μm, He |
Capillary | ZB-1 | 70. | 1201.12 | Hoskovec, Grygarová, et al., 2005 | 30. m/0.32 mm/0.25 μm, He |
Capillary | ZB-1 | 80. | 1205.05 | Hoskovec, Grygarová, et al., 2005 | 30. m/0.32 mm/0.25 μm, He |
Capillary | ZB-1 | 90. | 1208.89 | Hoskovec, Grygarová, et al., 2005 | 30. m/0.32 mm/0.25 μm, He |

Kovats' RI, non-polar column, temperature ramp

Column type | Active phase | I | Reference | Comment |
---|---|---|---|---|
Capillary | OV-101 | 1223. | Padrayuttawat, Tamura, et al., 1996 | 50. m/0.25 mm/0.2 μm, N2, 2. K/min, 200. C @ 60. min; Tstart: 80. C |

Van Den Dool and Kratz RI, non-polar column, temperature ramp

Column type | Active phase | I | Reference | Comment |
---|---|---|---|---|
Capillary | ZB-5 | 1238. | Ruiz Perez-Cacho, Mahattanatawee, et al., 2007 | 30. m/0.32 mm/0.5 μm, He, 7. K/min, 265. C @ 5. min; Tstart: 40. C |
Capillary | ZB-5 | 1242. | Mahattanatawee, Rouseff, et al., 2005 | 30. m/0.32 mm/0.5 μm, He, 7. K/min, 265. C @ 5. min; Tstart: 40. C |
Capillary | DB-5 | 1254. | Högnadóttir and Rouseff, 2003 | 30. m/0.32 mm/0.5 μm, 7. K/min, 265. C @ 5. min; Tstart: 40. C |
Capillary | DB-5 | 1256. | Högnadóttir and Rouseff, 2003 | 30. m/0.32 mm/0.5 μm, 7. K/min, 265. C @ 5. min; Tstart: 40. C |
Capillary | CP Sil 8 CB | 1240. | Chevance and Farmer, 1999 | 60. C @ 5. min, 4. K/min, 220. C @ 30. min; Column length: 50. m; Column diameter: 0.32 mm |

Van Den Dool and Kratz RI, non-polar column, custom temperature program

Column type | Active phase | I | Reference | Comment |
---|---|---|---|---|
Capillary | BPX-5 | 1257. | Dharmawan, Kasapis, et al., 2007 | 30. m/0.25 mm/0.25 μm, He; Program: 35C => 4C/min => 200C => 30C/min => 300C (3min) |
Capillary | DB-5 | 1246. | Wang, Finn, et al., 2005 | 30. m/0.32 mm/1. μm, He; Program: 40C(2min) => 5C/min => 100C => 4C/min => 230C (10min) |
Capillary | DB-5 | 1234. | Klesk and Qian, 2003 | 30. m/0.25 mm/0.25 μm, He; Program: 40C(2min) => 5C/min => 100C => 4C/min => 230C(10min) |
Capillary | DB-5 | 1249. | Klesk and Qian, 2003, 2 | 30. m/0.32 mm/1. μm, He; Program: 40C(2min) => 2C/min => 100C => 10C/min => 230C (5min) |

Van Den Dool and Kratz RI, polar column, temperature ramp

Column type | Active phase | I | Reference | Comment |
---|---|---|---|---|
Capillary | DB-Wax | 1752. | Ruiz Perez-Cacho, Mahattanatawee, et al., 2007 | 30. m/0.32 mm/0.5 μm, He, 7. K/min, 240. C @ 5. min; Tstart: 40. C |
Capillary | DB-Wax | 1740. | Choi, 2005 | 60. m/0.25 mm/0.25 μm, N2, 70. C @ 2. min, 2. K/min, 230. C @ 20. min |
Capillary | DB-Wax | 1747. | Mahattanatawee, Rouseff, et al., 2005 | 30. m/0.32 mm/0.5 μm, He, 7. K/min, 240. C @ 5. min; Tstart: 40. C |
Capillary | DB-Wax | 1751. | Högnadóttir and Rouseff, 2003 | 30. m/0.32 mm/0.5 μm, 7. K/min, 240. C @ 5. min; Tstart: 40. C |
Capillary | DB-Wax | 1744. | Choi and Sawamura, 2000 | 60. m/0.25 mm/0.25 μm, N2, 70. C @ 2. min, 2. K/min, 230. C @ 20. min |
Capillary | CP-Wax 52CB | 1714. | Chevance and Farmer, 1999 | 60. C @ 5. min, 4. K/min, 220. C @ 30. min; Column length: 50. m; Column diameter: 0.32 mm |
Capillary | CP-Wax 52CB | 1718. | Chevance and Farmer, 1999, 2 | 60. C @ 5. min, 4. K/min, 220. C @ 30. min; Column length: 50. m; Column diameter: 0.32 mm |
Capillary | DB-FFAP | 1717. | Guillard, le Quere, et al., 1997 | H2, 3. K/min; Column length: 30. m; Column diameter: 0.32 mm; Tstart: 40. C; Tend: 220. C |
Capillary | DB-FFAP | 1719. | Guillard, le Quere, et al., 1997 | H2, 3. K/min; Column length: 30. m; Column diameter: 0.32 mm; Tstart: 40. C; Tend: 220. C |

Van Den Dool and Kratz RI, polar column, custom temperature program

Column type | Active phase | I | Reference | Comment |
---|---|---|---|---|
Capillary | Stabilwax | 1745. | Wang, Finn, et al., 2005 | 30. m/0.32 mm/1. μm, He; Program: 40C(2min) => 5C/min => 100C => 4C/min => 230C (10min) |
Capillary | Stabilwax | 1749. | Klesk and Qian, 2003 | 30. m/0.32 mm/1. μm, He; Program: 40C(2min) => 5C/min => 100C => 4C/min => 230C(10min) |
Capillary | DB-Wax | 1751. | Klesk and Qian, 2003, 2 | 30. m/0.25 mm/0.5 μm, He; Program: 40C(2min) => 2C/min => 100C => 10C/min => 230C (5min) |

Normal alkane RI, non-polar column, temperature ramp

Column type | Active phase | I | Reference | Comment |
---|---|---|---|---|
Capillary | DB-5 | 1245. | Choi, 2006 | 30. m/0.25 mm/0.25 μm, N2, 70. C @ 2. min, 2. K/min, 230. C @ 20. min |
Capillary | DB-5 | 1242. | Agnihotri, Thappa, et al., 2004 | 30. m/0.25 mm/0.25 μm, He, 90. C @ 2. min, 7. K/min, 220. C @ 5. min |
Capillary | DB-1 | 1222. | Choi, 2004 | 60. m/0.25 mm/0.25 μm, N2, 70. C @ 2. min, 2. K/min, 230. C @ 20. min |
Capillary | ZB-5 | 1263. | Jürgens and Dötterl, 2004 | 60. m/0.25 mm/0.25 μm, He, 40. C @ 4.6 min, 6. K/min, 260. C @ 1. min |
Capillary | RSL-200 | 1231. | Jirovetz, Buchbauer, et al., 2003 | 30. m/0.25 mm/0.25 μm, H2, 40. C @ 2. min, 6. K/min, 280. C @ 10. min |
Capillary | DB-1 | 1270. | Hedin, McKibben, et al., 2000 | 30. m/0.32 mm/0.25 μm, 45. C @ 2. min, 15. K/min, 300. C @ 5. min |
Capillary | OV-101 | 1228. | Egolf and Jurs, 1993 | 2. K/min; Column length: 50. m; Column diameter: 0.22 mm; Tstart: 80. C; Tend: 200. C |
Capillary | SPB-5 | 1249. | King and Knight, 1992 | 8. K/min; Column length: 30. m; Phase thickness: 1.0 μm; Tstart: 50. C; Tend: 250. C |

Normal alkane RI, non-polar column, custom temperature program

Column type | Active phase | I | Reference | Comment |
---|---|---|---|---|
Capillary | HP-1 | 1210. | Carpino, Mallia, et al., 2004 | 12. m/0.32 mm/0.52 μm; Program: 35C(3min) => 6C/min => 190C => 30C/min => 225C |

Normal alkane RI, polar column, temperature ramp

Column type | Active phase | I | Reference | Comment |
---|---|---|---|---|
Capillary | DB-Wax | 1748. | Choi, 2006 | 60. m/0.25 mm/0.25 μm, N2, 70. C @ 2. min, 2. K/min, 230. C @ 20. min |
Capillary | DB-Wax | 1728. | Lee, Umano, et al., 2005 | 30. m/0.25 mm/0.25 μm, He, 3. K/min, 180. C @ 40. min; Tstart: 50. C |
Capillary | DB-Wax | 1741. | Choi, 2004 | 60. m/0.25 mm/0.25 μm, N2, 70. C @ 2. min, 2. K/min, 230. C @ 20. min |
Capillary | DB-Wax | 1721. | Umano, Hagi, et al., 2002 | 60. m/0.25 mm/0.25 μm, He, 40. C @ 2. min, 2. K/min; Tend: 200. C |
Capillary | DB-Wax | 1729. | Umano, Hagi, et al., 2000 | 60. m/0.25 mm/0.25 μm, He, 40. C @ 2. min, 2. K/min; Tend: 200. C |
Capillary | Carbowax 20M | 1715. | Egolf and Jurs, 1993 | 2. K/min; Column length: 80. m; Column diameter: 0.2 mm; Tstart: 70. C; Tend: 170. C |

References

Weast and Grasselli, 1989
CRC Handbook of Data on Organic Compounds, 2nd Editon, Weast,R.C and Grasselli, J.G., ed(s)., CRC Press, Inc., Boca Raton, FL, 1989, 1. [all data]
Hoskovec, Grygarová, et al., 2005
Hoskovec, Michal; Grygarová, Dana; Cvacka, Josef; Streinz, Ludvík; Zima, Jirí; Verevkin, Sergey P.; Koutek, Bohumír,
Determining the vapour pressures of plant volatiles from gas chromatographic retention data,
Journal of Chromatography A, 2005, 1083, 1-2, 161-172, https://doi.org/10.1016/j.chroma.2005.06.006
. [all data]
Aldrich Chemical Company Inc., 1990
Aldrich Chemical Company Inc.,
Catalog Handbook of Fine Chemicals, Aldrich Chemical Company, Inc., Milwaukee WI, 1990, 1. [all data]