[1,1'-Biphenyl]-3-amine
- Formula: C12H11N
- Molecular weight: 169.2224
- IUPAC Standard InChIKey: MUNOBADFTHUUFG-UHFFFAOYSA-N
- CAS Registry Number: 2243-47-2
- Chemical structure:
View 3d structure (requires JavaScript / HTML 5) - Other names: 3-Biphenylamine; 3-Aminobiphenyl; m-Aminobiphenyl; m-Phenylaniline; 3-Phenylaniline

Phase change data

Data compiled by: Robert L. Brown and Stephen E. Stein
Quantity | Value | Units | Method | Reference | Comment |
---|---|---|---|---|---|
Tfus | 304. to 304.6 | K | N/A | Buckingham and Donaghy, 1982 |
Reduced pressure boiling point
Tboil (K) | Pressure (bar) | Reference |
---|---|---|
527.2 | 0.180 | Weast and Grasselli, 1989 |
450.2 | 0.024 | Weast and Grasselli, 1989 |
527. | 0.180 | Buckingham and Donaghy, 1982 |
450. to 451. | 0.024 | Buckingham and Donaghy, 1982 |

Lee's RI, non-polar column, temperature ramp

Column type | Active phase | I | Reference | Comment |
---|---|---|---|---|
Capillary | SE-52 | 297.33 | Hasegawa, Usami, et al., 1990 | 2. K/min; Column length: 12. m; Column diameter: 0.25 mm; Tstart: 50. C; Tend: 270. C |

References

Buckingham and Donaghy, 1982
Buckingham, J.; Donaghy, S.M.,
Dictionary of Organic Compounds: Fifth Edition, Chapman and Hall, New York, 1982, 1. [all data]
Weast and Grasselli, 1989
CRC Handbook of Data on Organic Compounds, 2nd Editon, Weast,R.C and Grasselli, J.G., ed(s)., CRC Press, Inc., Boca Raton, FL, 1989, 1. [all data]
Hasegawa, Usami, et al., 1990
Hasegawa, K.; Usami, S.; Higashide, A.,
Analysis of amino polycyclic aromatic hydrocarbons and polycyclic aromatic nitrogen heterocycles,
Nippon Kagaku Kaishi, 1990, 7, 777-788, https://doi.org/10.1246/nikkashi.1990.777
. [all data]