Benzoic acid, 2-phenoxy-
- Formula: C13H10O3
- Molecular weight: 214.2167
- IUPAC Standard InChIKey: PKRSYEPBQPFNRB-UHFFFAOYSA-N
- CAS Registry Number: 2243-42-7
- Chemical structure:
View 3d structure (requires JavaScript / HTML 5) - Other names: Benzoic acid, o-phenoxy-; o-Phenoxybenzoic acid; 2-Phenoxybenzoic acid; ortho-Phenoxybenzoic acid

Phase change data

Data compiled by: Thermodynamics Research Center, NIST Boulder Laboratories, Chris Muzny director
Quantity | Value | Units | Method | Reference | Comment |
---|---|---|---|---|---|
Tfus | 386.15 | K | N/A | Beringer, Brierley, et al., 1953 | Uncertainty assigned by TRC = 2. K |

References

Beringer, Brierley, et al., 1953
Beringer, F.M.; Brierley, A.; Drexler, M.; Gindler, E.M.; Lumpkin, C.C.,
Diaryliodonium Salts II. The Phenylation of Organic and Inorganic Bases,
J. Am. Chem. Soc., 1953, 75, 2708. [all data]