Pentamethylbenzoic acid
- Formula: C12H16O2
- Molecular weight: 192.2542
- IUPAC Standard InChIKey: MNLKGWIYXCKWBU-UHFFFAOYSA-N
- CAS Registry Number: 2243-32-5
- Chemical structure:
View 3d structure (requires JavaScript / HTML 5) - Other names: Benzoic acid, pentamethyl-

Condensed phase thermochemistry data

Data compiled as indicated in comments:
ALS - Hussein Y. Afeefy, Joel F. Liebman, and Stephen E. Stein
DH - Eugene S. Domalski and Elizabeth D. Hearing
Quantity | Value | Units | Method | Reference | Comment |
---|---|---|---|---|---|
ΔfH°solid | -536.3 ± 2.3 | kJ/mol | Cm | Colomina, Jimenez, et al., 1988 | see Colomina, Perez-Ossorio, et al., 1964; ALS |
Constant pressure heat capacity of solid
Cp,solid (J/mol*K) | Temperature (K) | Reference | Comment |
---|---|---|---|
249.9 | 298.15 | Colomina, Jimenez, et al., 1988 | DH |

Phase change data

Data compiled as indicated in comments:
ALS - Hussein Y. Afeefy, Joel F. Liebman, and Stephen E. Stein
DRB - Donald R. Burgess, Jr.
AC - William E. Acree, Jr., James S. Chickos
Quantity | Value | Units | Method | Reference | Comment |
---|---|---|---|---|---|
ΔsubH° | 113.4 ± 1.8 | kJ/mol | V | Colomina, Jimenez, et al., 1988 | see Colomina, Perez-Ossorio, et al., 1964; ALS |
ΔsubH° | 113.4 | kJ/mol | N/A | Colomina, Jimenez, et al., 1988 | DRB |
ΔsubH° | 113.4 ± 1.8 | kJ/mol | N/A | Colomina, Jimenez, et al., 1988 | AC |
Enthalpy of sublimation
ΔsubH (kJ/mol) | Temperature (K) | Method | Reference | Comment |
---|---|---|---|---|
111.5 ± 1.7 | 355. | ME | Colomina, Jimenez, et al., 1988 | Based on data from 347. to 363. K.; AC |

Reaction thermochemistry data

Data compiled by: John E. Bartmess
Individual Reactions
C12H15O2- + =
By formula: C12H15O2- + H+ = C12H16O2
Quantity | Value | Units | Method | Reference | Comment |
---|---|---|---|---|---|
ΔrG° | 1389. ± 8.8 | kJ/mol | IMRE | Decouzon, Gal, et al., 1997 | gas phase |

Gas phase ion energetics data

Data compiled by: John E. Bartmess
De-protonation reactions
C12H15O2- + =
By formula: C12H15O2- + H+ = C12H16O2
Quantity | Value | Units | Method | Reference | Comment |
---|---|---|---|---|---|
ΔrG° | 1389. ± 8.8 | kJ/mol | IMRE | Decouzon, Gal, et al., 1997 | gas phase |

Gas phase thermochemistry data

Data compiled by: Hussein Y. Afeefy, Joel F. Liebman, and Stephen E. Stein

Quantity Value Units Method Reference Comment
Δfgas-422.9 ± 2.9kJ/molCmColomina, Jimenez, et al., 1988see Colomina, Perez-Ossorio, et al., 1964

References

Colomina, Jimenez, et al., 1988
Colomina, M.; Jimenez, P.; Perez-Ossorio, R.; Roux, M.V.; Turrion, C.,
Thermochemical properties of benzoic acid derivatives. XVI. Vapour pressures and enthalpies of sublimation and formation of the three tetramethylbenzoic acids and of pentamenthylbenzoic acid,
J. Chem. Thermodyn., 1988, 20, 575-580. [all data]
Colomina, Perez-Ossorio, et al., 1964
Colomina, M.; Perez-Ossorio, R.; Turrion, C.; Boned, M.L.; Pedraja, B.,
Investigaciones termoquimicas sobre los acidos alquilbenzoicos,
Anal. Fisc. Quim. B, 1964, 60, 627-638. [all data]
Decouzon, Gal, et al., 1997
Decouzon, M.; Gal, J.-F.; Maria, P.-C.; Bohm, S.; Jimenez, P.; Roux, M.V.; Exner, O.,
Steric Effects in Crowded Molecules in the Gas Phase: Polymethyl Substituted Benzoic Acids,
New J. Chem., 1997, 21, 561. [all data]
(editor), 1973
(editor), Koptyug V.A.,
Atlas of Spectra of Aromatic and Heterocyclic Compounds, 1973, 3, 61. [all data]