Nonanenitrile
- Formula: C9H17N
- Molecular weight: 139.2380
- IUPAC Standard InChIKey: PLZZPPHAMDJOSR-UHFFFAOYSA-N
- CAS Registry Number: 2243-27-8
- Chemical structure:
View 3d structure (requires JavaScript / HTML 5) - Other names: n-Nonanenitrile; n-Nonanonitrile; n-Octylcyanide; Nonanitrile; Nonanonitrile; Pelargonitrile; 1-Cyanooctane; Octyl cyanide; Pelargononitrile; 1-Octyl cyanide; Nonanetrile; Nonyl nitrile; NSC 5560; n-octanenitrile

Phase change data

Data compiled as indicated in comments:
BS - Robert L. Brown and Stephen E. Stein
TRC - Thermodynamics Research Center, NIST Boulder Laboratories, Chris Muzny director
AC - William E. Acree, Jr., James S. Chickos
Quantity | Value | Units | Method | Reference | Comment |
---|---|---|---|---|---|
Tboil | 497.6 | K | N/A | Weast and Grasselli, 1989 | BS |
Tboil | 497. | K | N/A | Deffet, 1931 | Uncertainty assigned by TRC = 1. K; ~; TRC |
Tboil | 488. | K | N/A | Mailhe, 1920 | Uncertainty assigned by TRC = 5. K; TRC |
Tboil | 488. | K | N/A | Eichler, 1879 | Uncertainty assigned by TRC = 8. K; TRC |
Quantity | Value | Units | Method | Reference | Comment |
Tfus | 223.65 | K | N/A | Timmermans, 1952 | Uncertainty assigned by TRC = 0.5 K; TRC |
Tfus | 238.95 | K | N/A | Deffet, 1931 | Uncertainty assigned by TRC = 1. K; TRC |
Quantity | Value | Units | Method | Reference | Comment |
ΔvapH° | 62.0 ± 0.3 | kJ/mol | GS | Emel'yanenko, Verevkin, et al., 2005 | Based on data from 285. to 323. K.; AC |
ΔvapH° | 58.0 | kJ/mol | EB | Ralston, Selby, et al., 1941 | Based on data from 314. to 480. K. See also Emel'yanenko, Verevkin, et al., 2005.; AC |
Enthalpy of vaporization
ΔvapH (kJ/mol) | Temperature (K) | Method | Reference | Comment |
---|---|---|---|---|
56.8 | 343. | A | Stephenson and Malanowski, 1987 | Based on data from 328. to 503. K.; AC |

Gas phase ion energetics data

Data compiled by: Michael M. Meot-Ner (Mautner)
Proton affinity at 298K
Proton affinity (kJ/mol) | Reference |
---|---|
807.1 | Cao and Holmes, 1999 |
812. | Cao and Holmes, 1999 |

Van Den Dool and Kratz RI, non-polar column, temperature ramp

Column type | Active phase | I | Reference | Comment |
---|---|---|---|---|
Capillary | DB-5 | 1185. | Rostad and Pereira, 1986 | 30. m/0.26 mm/0.25 μm, He, 50. C @ 4. min, 6. K/min, 300. C @ 20. min |

Van Den Dool and Kratz RI, non-polar column, custom temperature program

Column type | Active phase | I | Reference | Comment |
---|---|---|---|---|
Capillary | HP-5MS | 1182.2 | Andriamaharavo, 2014 | 30. m/0.25 mm/0.25 μm, He; Program: 60C (1 min) => 5 C/min => 210C => 10 C/min => 280C (15 min) |

Van Den Dool and Kratz RI, polar column, temperature ramp

Column type | Active phase | I | Reference | Comment |
---|---|---|---|---|
Capillary | Carbowax 20M | 1593. | Verzera, Campisi, et al., 2005 | 60. m/0.25 mm/0.25 μm, He, 45. C @ 0.17 min, 2. K/min; Tend: 250. C |
Capillary | CP-Wax 52CB | 1593. | Verzera, Campisi, et al., 2001 | 60. m/0.25 mm/0.25 μm, He, 45. C @ 0.17 min, 2. K/min; Tend: 250. C |

Normal alkane RI, polar column, temperature ramp

Column type | Active phase | I | Reference | Comment |
---|---|---|---|---|
Capillary | CP-Wax 52CB | 1565. | Rohloff and Bones, 2005 | 30. m/0.32 mm/0.25 μm, He, 40. C @ 1. min, 4. K/min; Tend: 220. C |

Normal alkane RI, polar column, custom temperature program

Column type | Active phase | I | Reference | Comment |
---|---|---|---|---|
Capillary | Carbowax 20M | 1593. | Editorial paper, 2005 | Program: not specified |

Lee's RI, non-polar column, temperature ramp

Column type | Active phase | I | Reference | Comment |
---|---|---|---|---|
Capillary | DB-5 | 199.75 | Rostad and Pereira, 1986 | 30. m/0.26 mm/0.25 μm, He, 50. C @ 4. min, 6. K/min, 300. C @ 20. min |

References

Weast and Grasselli, 1989
CRC Handbook of Data on Organic Compounds, 2nd Editon, Weast,R.C and Grasselli, J.G., ed(s)., CRC Press, Inc., Boca Raton, FL, 1989, 1. [all data]
Deffet, 1931
Deffet, L.,
The Freezing Points of Organic Compounds XIII. Compounds With Seven Eight, Nine or Ten Carbon Atoms,
Bull. Soc. Chim. Belg., 1931, 40, 385-402. [all data]
Mailhe, 1920
Mailhe, A.,
Ann. Chim. (Paris), 1920, 13, 183. [all data]
Eichler, 1879
Eichler, E.,
Contribution to the Knowledge of Octyl Derivatives,
Chem. Ber., 1879, 12, 1879. [all data]
Timmermans, 1952
Timmermans, J.,
Freezing points of organic compounds. VVI New determinations.,
Bull. Soc. Chim. Belg., 1952, 61, 393. [all data]
Emel'yanenko, Verevkin, et al., 2005
Emel'yanenko, Vladimir N.; Verevkin, Sergey P.; Koutek, Bohumir; Doubsky, Jan,
Vapour pressures and enthalpies of vapourization of a series of the linear aliphatic nitriles,
The Journal of Chemical Thermodynamics, 2005, 37, 1, 73-81, https://doi.org/10.1016/j.jct.2004.08.004
. [all data]
Ralston, Selby, et al., 1941
Ralston, A.W.; Selby, W.M.; Pool, W.O.,
Boiling Points of n-Alkyl Nitriles,
Ind. Eng. Chem., 1941, 33, 5, 682-683, https://doi.org/10.1021/ie50377a033
. [all data]
Stephenson and Malanowski, 1987
Stephenson, Richard M.; Malanowski, Stanislaw,
Handbook of the Thermodynamics of Organic Compounds, 1987, https://doi.org/10.1007/978-94-009-3173-2
. [all data]
Cao and Holmes, 1999
Cao, J.; Holmes, J.L.,
Determining the proton affinities of nitriles by the kinetic method,
European J. Mass Spectrometry, 1999, 5, 19-22. [all data]
Rostad and Pereira, 1986
Rostad, C.E.; Pereira, W.E.,
Kovats and Lee retention indices determined by gas chromatography/mass spectrometry for organic compounds of environmental interest,
J. Hi. Res. Chromatogr. Chromatogr. Comm., 1986, 9, 6, 328-334, https://doi.org/10.1002/jhrc.1240090603
. [all data]
Andriamaharavo, 2014
Andriamaharavo, N.R.,
Retention Data. NIST Mass Spectrometry Data Center., NIST Mass Spectrometry Data Center, 2014. [all data]
Verzera, Campisi, et al., 2005
Verzera, A.; Campisi, S.; Zappalá, M.,
SUPELCO. Using SPME-GC-MS to characterize volatile components of honey as indicators of botanical origin, 2005, retrieved from http://www.sigmaaldrich.com/Brands/SupelcoHome/TheReporter.html. [all data]
Verzera, Campisi, et al., 2001
Verzera, A.; Campisi, S.; Zappalá, M.; Bonaccorsi, I.,
SPME-GC-MS analysis of honey volatile components for the characterization of different floral origin,
Am. Lab. Fairfield Conn., 2001, 33, 15, 18-21. [all data]
Rohloff and Bones, 2005
Rohloff, J.; Bones, A.M.,
Volatile profiling of Arabidopsis thaliana - Putative olfactory compounds in plant communication,
Phytochemistry, 2005, 66, 16, 1941-1955, https://doi.org/10.1016/j.phytochem.2005.06.021
. [all data]
Editorial paper, 2005
Editorial paper,
Solid Phase Microextraction (SPME) Application Guide,
The Reporter Europe (Supelco), 2005, 16, 5, 12-12. [all data]