2,6,6-Trimethyl-5-oxa-2-heptanol
- Formula: C9H20O2
- Molecular weight: 160.2539
- IUPAC Standard InChIKey: FWYJECFVUAJCPF-UHFFFAOYSA-N
- CAS Registry Number: 22419-28-9
- Chemical structure:
View 3d structure (requires JavaScript / HTML 5) - Permanent link for this species. Use this link for bookmarking this species for future reference.

Phase change data

Data compiled by: William E. Acree, Jr., James S. Chickos
Enthalpy of vaporization
ΔvapH (kJ/mol) | Temperature (K) | Method | Reference | Comment |
---|---|---|---|---|
61.5 | 382. | A | Stephenson and Malanowski, 1987 | Based on data from 367. to 483. K. |
53.3 | 344. | N/A | Kachalova and Nemtsov, 1968 | Based on data from 329. to 454. K. See also Boublik, Fried, et al., 1984. |

References

Stephenson and Malanowski, 1987
Stephenson, Richard M.; Malanowski, Stanislaw,
Handbook of the Thermodynamics of Organic Compounds, 1987, https://doi.org/10.1007/978-94-009-3173-2
. [all data]
Kachalova and Nemtsov, 1968
Kachalova, R.V.; Nemtsov, M.S.,
Zh. Prikl. Khim. (Leningrad), 1968, 41, 10, 2315. [all data]
Boublik, Fried, et al., 1984
Boublik, T.; Fried, V.; Hala, E.,
The Vapour Pressures of Pure Substances: Selected Values of the Temperature Dependence of the Vapour Pressures of Some Pure Substances in the Normal and Low Pressure Region, 2nd ed., Elsevier, New York, 1984, 972. [all data]