3-Diethylamino-1-phenylpropyne
- Formula: C13H17N
- Molecular weight: 187.2808
- IUPAC Standard InChIKey: NGTMXVYXKKHDPO-UHFFFAOYSA-N
- CAS Registry Number: 22396-72-1
- Chemical structure:
View 3d structure (requires JavaScript / HTML 5) - Other names: 2-Propynylamine, N,N-diethyl-3-phenyl-; N,N-Diethyl-3-phenyl-2-propynylamine

Phase change data

Data compiled by: Robert L. Brown and Stephen E. Stein
Reduced pressure boiling point
Tboil (K) | Pressure (bar) | Reference |
---|---|---|
418. to 419. | 0.027 | Frinton Laboratories Inc., 1986 |

References

Frinton Laboratories Inc., 1986
Frinton Laboratories Inc.,
Catalog Number 11, Frinton Laboratories Inc., Vineland, NJ, 1986, 99. [all data]