2-Methylbenzyl cyanide
- Formula: C9H9N
- Molecular weight: 131.1745
- IUPAC Standard InChIKey: WMGVPDQNPUQRND-UHFFFAOYSA-N
- CAS Registry Number: 22364-68-7
- Chemical structure:
View 3d structure (requires JavaScript / HTML 5) - Other names: o-Xylyl cyanide; o-Methylbenzyl cyanide; o-Tolylacetonitrile; o-Methylphenylacetonitrile; 2-Tolylacetonitrile; 2-Methylphenylacetonitrile; Benzeneacetonitrile, 2-methyl-; Acetonitrile, o-tolyl-; 2-Methylbenzeneacetonitrile

Condensed phase thermochemistry data

Data compiled by: Hussein Y. Afeefy, Joel F. Liebman, and Stephen E. Stein
Quantity | Value | Units | Method | Reference | Comment |
---|---|---|---|---|---|
ΔfH°liquid | 92. | kJ/mol | Ccb | Zavoianu, Contineanu, et al., 1987 | |
Quantity | Value | Units | Method | Reference | Comment |
ΔcH°liquid | -4921. | kJ/mol | Ccb | Zavoianu, Contineanu, et al., 1987 |

Phase change data

Data compiled by: Robert L. Brown and Stephen E. Stein
Quantity | Value | Units | Method | Reference | Comment |
---|---|---|---|---|---|
Tboil | 485.2 | K | N/A | Weast and Grasselli, 1989 |

References

Zavoianu, Contineanu, et al., 1987
Zavoianu, D.; Contineanu, I.; Moga-Gheorghe, S.; Marchidan, D.I.,
Structure and reactivity of nitriles. II. Condensing reactions of methyl and dimethylphenylacetonitriles with substituted aromatic aldehydes,
Rev. Chim. (Bucharest), 1987, 38, 9-15. [all data]
Weast and Grasselli, 1989
CRC Handbook of Data on Organic Compounds, 2nd Editon, Weast,R.C and Grasselli, J.G., ed(s)., CRC Press, Inc., Boca Raton, FL, 1989, 1. [all data]