Benzophenone dimethyl ketal
- Formula: C15H16O2
- Molecular weight: 228.2863
- IUPAC Standard InChIKey: NYRVXYOKUZSUDA-UHFFFAOYSA-N
- CAS Registry Number: 2235-01-0
- Chemical structure:
View 3d structure (requires JavaScript / HTML 5) - Other names: Benzene, 1,1'-(dimethoxymethylene)bis-; 1,1'-(dimethoxymethylene)bisbenzene; benzophenone dimethyl acetal; Dimethoxydiphenylmethane

Phase change data

Data compiled by: William E. Acree, Jr., James S. Chickos
Quantity | Value | Units | Method | Reference | Comment |
---|---|---|---|---|---|
ΔsubH° | 103.9 ± 1.7 | kJ/mol | N/A | Verevkin, Peng, et al., 1998 |
Enthalpy of fusion
ΔfusH (kJ/mol) | Temperature (K) | Method | Reference |
---|---|---|---|
27.8 | 380. | DSC | Verevkin, Peng, et al., 1998 |

References

Verevkin, Peng, et al., 1998
Verevkin, S.P.; Peng, W.-H.; Beckhaus, H.D.; Rücuardt, C.,
Geminal substituent effects. 16. Does the anomeric effect in ketals depend on the hybridization of the central carbon atom?,
Eur. J. Org. Chem., 1998, 11, 2323. [all data]