tri-n-Propylphosphine
- Formula: C9H21P
- Molecular weight: 160.2368
- IUPAC Standard InChIKey: KCTAHLRCZMOTKM-UHFFFAOYSA-N
- CAS Registry Number: 2234-97-1
- Chemical structure:
View 3d structure (requires JavaScript / HTML 5) - Other names: Phosphine, tripropyl-; tripropylphosphine

Phase change data

Data compiled by: William E. Acree, Jr., James S. Chickos
Enthalpy of vaporization
ΔvapH (kJ/mol) | Temperature (K) | Reference | Comment |
---|---|---|---|
39.4 ± 0.2 | 346. | Baev, 2001 | Based on data from 324. to 368. K. |

References

Baev, 2001
Baev, A.K.,
Izv. Vyssh. Uchebn. Zaved., Khim. Khim. Tekhnol., 2001, 44, 1, 3. [all data]