2-Norbornanecarbonitrile
- Formula: C8H11N
- Molecular weight: 121.1796
- IUPAC Standard InChIKey: GAHKEUUHTHVKEA-UHFFFAOYSA-N
- CAS Registry Number: 2234-26-6
- Chemical structure:
View 3d structure (requires JavaScript / HTML 5) - Stereoisomers:
- Other names: norbornane-2-carbonitrile

Phase change data

Data compiled by: Robert L. Brown and Stephen E. Stein
Reduced pressure boiling point
Tboil (K) | Pressure (atm) | Reference |
---|---|---|
347.2 | 0.013 | Weast and Grasselli, 1989 |

References

Weast and Grasselli, 1989
CRC Handbook of Data on Organic Compounds, 2nd Editon, Weast,R.C and Grasselli, J.G., ed(s)., CRC Press, Inc., Boca Raton, FL, 1989, 1. [all data]