Aluminum anion
- Formula: Al-
- Molecular weight: 26.9820872
- IUPAC Standard InChIKey: WVZWSVHLGBNEIG-UHFFFAOYSA-N
- CAS Registry Number: 22325-47-9
- Chemical structure:
View 3d structure (requires JavaScript / HTML 5) - Information on this page:

Gas phase thermochemistry data

Data compiled as indicated in comments:
B - John E. Bartmess
Quantity | Value | Units | Method | Reference | Comment |
---|---|---|---|---|---|
ΔfH°gas | 288.2 ± 3.0 | kJ/mol | R-EA | Scheer, Bilodeau, et al., 1998 | Given: 432.83(5) meV; B |
Quantity | Value | Units | Method | Reference | Comment |
S°gas,1 bar | 168.14 | J/mol*K | Review | Chase, 1998 | Data last reviewed in June, 1983 |

Reaction thermochemistry data

Data compiled by: John E. Bartmess
Individual Reactions
Quantity | Value | Units | Method | Reference | Comment |
---|---|---|---|---|---|
ΔrH° | 1555.2 ± 2.9 | kJ/mol | D-EA | Scheer, Bilodeau, et al., 1998 | gas phase; Given: 432.83(5) meV |
Quantity | Value | Units | Method | Reference | Comment |
ΔrG° | 1528.7 ± 3.3 | kJ/mol | H-TS | Scheer, Bilodeau, et al., 1998 | gas phase; Given: 432.83(5) meV |

Gas phase ion energetics data

Data compiled by: John E. Bartmess
Protonation reactions
Quantity | Value | Units | Method | Reference | Comment |
---|---|---|---|---|---|
ΔrH° | 1555.2 ± 2.9 | kJ/mol | D-EA | Scheer, Bilodeau, et al., 1998 | gas phase; Given: 432.83(5) meV |
Quantity | Value | Units | Method | Reference | Comment |
ΔrG° | 1528.7 ± 3.3 | kJ/mol | H-TS | Scheer, Bilodeau, et al., 1998 | gas phase; Given: 432.83(5) meV |

References

Scheer, Bilodeau, et al., 1998
Scheer, M.; Bilodeau, RC; Thogresen, J.; Haugen, HK,
Threshold Photodetachment of Al-: Electron Affinity and Fine Structure,
Phys. Rev. A, 1998, 57, 3, R1493-, https://doi.org/10.1103/PhysRevA.57.R1493
. [all data]
Chase, 1998
Chase, M.W., Jr.,
NIST-JANAF Themochemical Tables, Fourth Edition,
J. Phys. Chem. Ref. Data, Monograph 9, 1998, 1-1951. [all data]