Clobazam

Phase change data

Data compiled by: Thermodynamics Research Center, NIST Boulder Laboratories, Chris Muzny director

Quantity Value Units Method Reference Comment
Tfus455.1KN/AChauvet, Rubio, et al., 1982Uncertainty assigned by TRC = 0.5 K

In addition to the Thermodynamics Research Center (TRC) data available from this site, much more physical and chemical property data is available from the following TRC products:

Kovats' RI, non-polar column, isothermal

View large format table.

Column type Active phase Temperature (C) I Reference Comment
CapillaryBP-1250.2582.Japp, Garthwaite, et al., 198825. m/0.22 mm/0.25 μm, N2
CapillarySPB-1250.2565.Lora-Tamayo, Rams, et al., 1986He; Column length: 25. m; Column diameter: 0.20 mm

Van Den Dool and Kratz RI, non-polar column, temperature ramp

View large format table.

Column type Active phase I Reference Comment
CapillaryVF-5MS2647.6Tretyakov, 201430. m/0.25 mm/0.25 μm, He; Tstart: 60. C; Tend: 270. C

Normal alkane RI, non-polar column, isothermal

View large format table.

Column type Active phase Temperature (C) I Reference Comment
CapillarySPB-5220.2605.Chiarotti, de Giovanni, et al., 1986Column length: 30. m; Column diameter: 0.75 mm

Normal alkane RI, non-polar column, temperature ramp

View large format table.

Column type Active phase I Reference Comment
CapillaryBP-12582.MHA, 9999Tstart: 100. C; Tend: 300. C
CapillaryDB-52582.Zamechnik, Ethier, et al., 198915. m/0.25 mm/0.25 μm, He, 150. C @ 1. min, 10. K/min; Tend: 260. C
PackedSE-302559.Chiarotti, de Giovanni, et al., 1986He, Chromosorb W(100-120 mesh), 200. C @ 2. min, 4. K/min, 285. C @ 10. min; Column length: 2. m

Normal alkane RI, non-polar column, custom temperature program

View large format table.

Column type Active phase I Reference Comment
CapillarySPB-12557.Chiarotti, de Giovanni, et al., 1986He, Chromosorb W(100-120 mesh); Column length: 25. m; Phase thickness: 0.4 μm

References

Chauvet, Rubio, et al., 1982
Chauvet, A.; Rubio, S.; Masse, J., Etude thermoanalytique de substances psychotherapeutiques.I, Thermochim. Acta, 1982, 57, 173. [all data]