1-Piperidinyloxy, 4-hydroxy-2,2,6,6-tetramethyl-
- Formula: C9H18NO2
- Molecular weight: 172.2447
- IUPAC Standard InChIKey: UZFMOKQJFYMBGY-UHFFFAOYSA-N
- CAS Registry Number: 2226-96-2
- Chemical structure:
View 3d structure (requires JavaScript / HTML 5) - Other names: Piperidinooxy, 4-hydroxy-2,2,6,6-tetramethyl-; Tanol; Tempol; Tetramethylpiperidino-N-oxyl; Tetramethylpiperidinol N-oxyl; TMPN; 2,2,4,4-Tetramethyl-4-Piperidinol N-oxide; 2,2,6,6-Tetramethyl-4-hydroxypiperidin-1-oxyl; 2,2,6,6-Tetramethyl-4-hydroxypiperidinooxy; 2,2,6,6-Tetramethyl-4-hydroxypiperidinooxy radical; 2,2,6,6-Tetramethyl-4-hydroxypiperidyl 1-oxyl; 2,2,6,6-Tetramethyl-4-oxypiperidine-1-oxyl; 2,2,6,6-Tetramethyl-4-piperidinol nitroxide; 2,2,6,6-Tetramethyl-4-piperidinol N-oxyl; 2,2,6,6-Tetramethyl-4-piperidinol 1-oxyl; 2,2,6,6-Tetramethyl-4-piperidinol-1-oxy; 2,2,6,6-Tetramethylpiperidine-N-oxyl-4-ol; 4-Hydroxy-2,2,6,6-tetramethylpiperidine 1-oxyl; 4-Hydroxy-2,2,6,6-tetramethylpiperidinooxy; 4-Hydroxy-2,2,6,6-tetramethylpiperidinooxy radical; 4-Hydroxy-2,2,6,6-tetramethylpiperidinooxyl; 4-Oxypiperidol; 4-Hydroxy-2,2,6,6-tetramethyl-1-piperidinyloxy; 1-Oxyl-2,2,6,6-tetramethyl-4-piperidinol; 2,2,6,6-Tetramethyl-4-piperindiol 1-oxyl; 2,2,6,6-Tetramethylpiperidinol-4-oxyl-1; 4-Hydroxy-2,2,6,-tetramethylpiperidyl-1-oxy; 4-Hydroxy-2,2,6,-tetramethylpiperidyl-1-oxyl; 4-Hydroxy-2,2,6,6-tetramethylpiperidine-N-oxy; 4-Hydroxy-2,2,6,6-tetramethylpiperidinoxy; Piperidinyloxy, 4-hydroxy-2,2,6,6-tetramethyl-; 2,2,6,6-Tetramethyl-4-piperidinol 1-oxide; 4-Hydroxy-2,2,6,6-tetramethylpiperidine N-oxide; 4-Hydroxy-2,2,6,6-tetramethylpiperidinoxyl; NR I; Nitroxyl 2

Gas phase thermochemistry data

Data compiled by: Hussein Y. Afeefy, Joel F. Liebman, and Stephen E. Stein
Quantity | Value | Units | Method | Reference | Comment |
---|---|---|---|---|---|
ΔfH°gas | -291.2 ± 9.2 | kJ/mol | Ccb | Lebedev, Rozantzev, et al., 1966 |

Condensed phase thermochemistry data

Data compiled by: Hussein Y. Afeefy, Joel F. Liebman, and Stephen E. Stein
Quantity | Value | Units | Method | Reference | Comment |
---|---|---|---|---|---|
ΔfH°solid | -392.8 ± 7.6 | kJ/mol | Ccb | Lebedev, Rozantzev, et al., 1966 | |
Quantity | Value | Units | Method | Reference | Comment |
ΔcH°solid | -5721.4 ± 7.6 | kJ/mol | Ccb | Lebedev, Rozantzev, et al., 1966 |

Phase change data

Data compiled as indicated in comments:
AC - William E. Acree, Jr., James S. Chickos
ALS - Hussein Y. Afeefy, Joel F. Liebman, and Stephen E. Stein
Enthalpy of sublimation
ΔsubH (kJ/mol) | Temperature (K) | Method | Reference | Comment |
---|---|---|---|---|
101.5 ± 5.2 | 306. | ME | Lebedev, Rosantsev, et al., 1966 | Based on data from 293. to 318. K. See also Cox and Pilcher, 1970.; AC |
101.5 ± 1.6 | 293. | V | Kalashnikova, Rozantsev, et al., 1965 | ALS |

References

Lebedev, Rozantzev, et al., 1966
Lebedev, Yu.A.; Rozantzev, E.G.; Kalashnikova, L.A.; Lebedev, V.P.; Neiman, M.B.; Apin, A.Ya.,
Thermochemical study of certain free radicals and the corresponding hydrides,
Dokl. Phys. Chem. (Engl. Transl.), 1966, 168, 460-462, In original 104. [all data]
Lebedev, Rosantsev, et al., 1966
Lebedev, Y.A.; Rosantsev, E.G.; Kalashnikova, L.A.; Lebedev, V.P.; Nieman, M.B.; Apin, Y.A.,
Dokl. Akad. Nauk SSSR, 1966, 168, 1, 104. [all data]
Cox and Pilcher, 1970
Cox, J.D.; Pilcher, G.,
Thermochemistry of Organic and Organometallic Compounds, Academic Press Inc., London, 1970, 643. [all data]
Kalashnikova, Rozantsev, et al., 1965
Kalashnikova, L.A.; Rozantsev, E.G.; Chaikin, A.M.,
Saturated vapor pressure of certain stable free radicals,
Bull. Acad. Sci. USSR, Div. Chem. Sci., 1965, 782-785. [all data]