2-phenylindan
- Formula: C15H14
- Molecular weight: 194.2717
- IUPAC Standard InChIKey: PZZIWXQGJNDBRF-UHFFFAOYSA-N
- CAS Registry Number: 22253-11-8
- Chemical structure:
View 3d structure (requires JavaScript / HTML 5) - Other names: 2,3-dihydro-2-phenyl-1H-indene

Phase change data

Data compiled by: Thermodynamics Research Center, NIST Boulder Laboratories, Chris Muzny director
Quantity | Value | Units | Method | Reference | Comment |
---|---|---|---|---|---|
Tfus | 290. | K | N/A | Anonymous, 1969 | Uncertainty assigned by TRC = 3. K |

References

Anonymous, 1969
Anonymous, R.,
Freon Fluorocarbons - properties and applications, E. I. Du Pont, Freon Product Information, B-2, 1969. [all data]