Tetrachlorvinphos
- Formula: C10H9Cl4O4P
- Molecular weight: 365.962
- IUPAC Standard InChIKey: UBCKGWBNUIFUST-YHYXMXQVSA-N
- CAS Registry Number: 22248-79-9
- Chemical structure:
View 3d structure (requires JavaScript / HTML 5) - Other names: Stirifos; Phosphoric acid, 2-chloro-1-(2,4,5-trichlorophenyl)ethenyl dimethyl ester, (Z)-; Stirofos; CVMP; Gardona; Rabon; Stirophos; SD 8447; Vinfos; (Z)-2-Chloro-1-(2,4,5-trichlorophenyl)vinyl dimethyl phosphate; Appex; Debantic; Dietreen; Dust M; ENT 25,841; Gardcide; Gordona; Rabond; ROL; cis-Gardona; cis-Tetrachlorvinphos; Tetrachlorvinphos, (Z); (Z)-Tetrachlorovinphos; Phosphoric acid, (1Z)-2-chloro-1-(2,4,5-trichlorophenyl)ethenyl dimethyl ester; Phosphoric acid, 2-chloro-1-(2,4,5-trichlorophenyl)vinyl dimethyl ester, (Z)-; Stitifos; Tetrachlorvinfos; (Z)-2-Chloro-1-(2,4,5-trichlorophenyl)ethenyl dimethyl phosphate

Phase change data

Data compiled by: Thermodynamics Research Center, NIST Boulder Laboratories, Chris Muzny director
Quantity | Value | Units | Method | Reference | Comment |
---|---|---|---|---|---|
Tfus | 369.65 | K | N/A | Donnelly, Drewes, et al., 1990 | Uncertainty assigned by TRC = 0.2 K |
Tfus | 369. | K | N/A | Plato, 1972 | Uncertainty assigned by TRC = 0.2 K |
Tfus | 370. | K | N/A | Plato, 1972 | Uncertainty assigned by TRC = 0.2 K |

References

Donnelly, Drewes, et al., 1990
Donnelly, J.R.; Drewes, L.A.; Johnson, R.L.; Munslow, W.D.; Knapp, K.K.; Sovocool, G.W.,
Purity and heat of fusion data for environmental standards as determined by differential scanning calorimetry,
Thermochim. Acta, 1990, 167, 2, 155, https://doi.org/10.1016/0040-6031(90)80476-F
. [all data]
Plato, 1972
Plato, C.,
DSC as a general method for determining purity and heat of fusion of high-purity organic chemicals,
Anal. Chem., 1972, 44, 1531. [all data]